Удаленка для jenkins+selenide+selenoid+allure+docker спецов на 2-3 часа в день. 100% remote! Присоединиться к проекту

Ошибка 'dependencies.dependency.systemPath' при сборке Maven

maven
java
Теги: #<Tag:0x00007fedc0ec7420> #<Tag:0x00007fedc0ec7218>

(Татьяна Иванова) #1

Проблема заключается в невозможности собрать проект Maven.

У заказчика нет на машине интернета. Репозиторий - копия моего, кот. у них лежит в папке пользователя + свой. При запуске тестов с помощью mvn test такая ошибка:

В pom указанные в ошибке org.testng:guice:jar и testng с версиями 4.1.0 и 6.11.

Что нужно сделать с этими плагинами?

Код pom:

<project xmlns="http://maven.apache.org/POM/4.0.0" xmlns:xsi="http://www.w3.org/2001/XMLSchema-instance"
	xsi:schemaLocation="http://maven.apache.org/POM/4.0.0 http://maven.apache.org/xsd/maven-4.0.0.xsd">
	<modelVersion>4.0.0</modelVersion>
	<groupId></groupId>
	<artifactId></artifactId>
	<version>1.0</version>
	<properties>
		<project.build.sourceEncoding>UTF-8</project.build.sourceEncoding>
	</properties>

<!-- для отправки на RP -->
	<!-- repositories>
		<repository>
			<snapshots>
				<enabled>false</enabled>
			</snapshots>
			<id>bintray-epam-reportportal</id>
			<name>bintray</name>
			<url>http://dl.bintray.com/epam/reportportal</url>
		</repository>
	</repositories-->

	<dependencies>
		<!-- для отправки на RP -->
		<!-- dependency>
			<groupId>com.epam.reportportal</groupId>
			<artifactId>agent-java-testng</artifactId>
			<version>2.7.0</version>
		</dependency>
		<dependency>
			<groupId>com.epam.reportportal</groupId>
			<artifactId>logger-java-logback</artifactId>
			<version>2.6.0</version>
		</dependency>
		<dependency>
			<groupId>com.epam.reportportal</groupId>
			<artifactId>logger-java-log4j</artifactId>
			<version>2.6.1</version>
		</dependency-->
		
		<dependency>
			<groupId>org.slf4j</groupId>
			<artifactId>slf4j-api</artifactId>
			<version>1.7.25</version>
		</dependency>
		<dependency>
			<groupId>org.slf4j</groupId>
			<artifactId>slf4j-log4j12</artifactId>
			<version>1.7.25</version>
		</dependency>	
		<dependency>
			<groupId>com.codeborne</groupId>
			<artifactId>selenide</artifactId>
			<version>4.8</version>
			<exclusions>
				<exclusion>
					<groupId>org.seleniumhq.selenium</groupId>
					<artifactId>htmlunit-driver</artifactId>
				</exclusion>
				<exclusion>
					<groupId>junit</groupId>
					<artifactId>junit</artifactId>
				</exclusion>
			</exclusions>
		</dependency>
		<dependency>
			<groupId>org.seleniumhq.selenium</groupId>
			<artifactId>selenium-support</artifactId>
			<version>3.6.0</version>
			<exclusions>
				<exclusion>
					<groupId>junit</groupId>
					<artifactId>junit</artifactId>
				</exclusion>
			</exclusions>
		</dependency>
		<dependency>
			<groupId>commons-io</groupId>
			<artifactId>commons-io</artifactId>
			<version>2.5</version>
		</dependency>
		<dependency>
			<groupId>org.testng</groupId>
			<artifactId>testng</artifactId>
			<version>6.11</version>
<scope>test</scope>
		</dependency>
		<dependency>
			<groupId>org.uncommons</groupId>
			<artifactId>reportng</artifactId>
			<version>1.1.4</version>
		</dependency>
		<dependency>
			<groupId>com.microsoft.sqlserver</groupId>
			<artifactId>mssql-jdbc</artifactId>
			<version>6.2.2.jre8</version>
		</dependency>
		<dependency>
			<groupId>com.google.inject</groupId>
			<artifactId>guice</artifactId>
			<version>4.1.0</version>
<scope>test</scope>
		</dependency>
		<dependency>
			<groupId>log4j</groupId>
			<artifactId>log4j</artifactId>
			<version>1.2.17</version>
		</dependency>
		<dependency>
			<groupId>ru.yandex.qatools.ashot</groupId>
			<artifactId>ashot</artifactId>
			<version>1.5.4</version>
		</dependency>
	</dependencies>

	<build>
		<plugins>
			<plugin>
				<groupId>org.apache.maven.plugins</groupId>
				<artifactId>maven-resources-plugin</artifactId>
				<version>3.0.2</version>
				<configuration>
					<encoding>UTF-8</encoding>
				</configuration>
			</plugin>
			<plugin>
				<groupId>org.apache.maven.plugins</groupId>
				<artifactId>maven-compiler-plugin</artifactId>
				<version>3.7.0</version>
				<configuration>
					<source>1.8</source>
					<target>1.8</target>
					<encoding>UTF-8</encoding>
				</configuration>
			</plugin>
			<plugin>
				<groupId>org.apache.maven.plugins</groupId>
				<artifactId>maven-surefire-plugin</artifactId>
				<version>2.20.1</version>
				<configuration>
					<argLine>-Dfile.encoding=UTF-8</argLine>
					<skip>false</skip>
					<suiteXmlFiles>
						<suiteXmlFile>${suite}</suiteXmlFile>
					</suiteXmlFiles>
					<properties>
						<property>
							<name>listener</name>
							<!-- ReportPortalTestNGListener - для отправки на RP -->
							<value><!-- com.epam.reportportal.testng.ReportPortalTestNGListener,-->
							org.uncommons.reportng.HTMLReporter</value>
						</property>
					</properties>
				</configuration>
			</plugin>
		</plugins>
	</build>
</project>

Лог полностью такой:

Apache Maven 3.5.0 (ff8f5e7444045639af65f6095c62210b5713f426; 2017-04-03T22:39:06+03:00)
Maven home: C:\apache-maven-3.5.0\bin\..
Java version: 1.8.0_131, vendor: Oracle Corporation
Java home: C:\Program Files\Java\jdk1.8.0_131\jre
Default locale: ru_RU, platform encoding: Cp1251
OS name: "windows 7", version: "6.1", arch: "amd64", family: "windows"
[DEBUG] Created new class realm maven.api
[DEBUG] Importing foreign packages into class realm maven.api
[DEBUG]   Imported: javax.enterprise.inject.* < plexus.core
[DEBUG]   Imported: javax.enterprise.util.* < plexus.core
[DEBUG]   Imported: javax.inject.* < plexus.core
[DEBUG]   Imported: org.apache.maven.* < plexus.core
[DEBUG]   Imported: org.apache.maven.artifact < plexus.core
[DEBUG]   Imported: org.apache.maven.classrealm < plexus.core
[DEBUG]   Imported: org.apache.maven.cli < plexus.core
[DEBUG]   Imported: org.apache.maven.configuration < plexus.core
[DEBUG]   Imported: org.apache.maven.exception < plexus.core
[DEBUG]   Imported: org.apache.maven.execution < plexus.core
[DEBUG]   Imported: org.apache.maven.execution.scope < plexus.core
[DEBUG]   Imported: org.apache.maven.lifecycle < plexus.core
[DEBUG]   Imported: org.apache.maven.model < plexus.core
[DEBUG]   Imported: org.apache.maven.monitor < plexus.core
[DEBUG]   Imported: org.apache.maven.plugin < plexus.core
[DEBUG]   Imported: org.apache.maven.profiles < plexus.core
[DEBUG]   Imported: org.apache.maven.project < plexus.core
[DEBUG]   Imported: org.apache.maven.reporting < plexus.core
[DEBUG]   Imported: org.apache.maven.repository < plexus.core
[DEBUG]   Imported: org.apache.maven.rtinfo < plexus.core
[DEBUG]   Imported: org.apache.maven.settings < plexus.core
[DEBUG]   Imported: org.apache.maven.toolchain < plexus.core
[DEBUG]   Imported: org.apache.maven.usability < plexus.core
[DEBUG]   Imported: org.apache.maven.wagon.* < plexus.core
[DEBUG]   Imported: org.apache.maven.wagon.authentication < plexus.core
[DEBUG]   Imported: org.apache.maven.wagon.authorization < plexus.core
[DEBUG]   Imported: org.apache.maven.wagon.events < plexus.core
[DEBUG]   Imported: org.apache.maven.wagon.observers < plexus.core
[DEBUG]   Imported: org.apache.maven.wagon.proxy < plexus.core
[DEBUG]   Imported: org.apache.maven.wagon.repository < plexus.core
[DEBUG]   Imported: org.apache.maven.wagon.resource < plexus.core
[DEBUG]   Imported: org.codehaus.classworlds < plexus.core
[DEBUG]   Imported: org.codehaus.plexus.* < plexus.core
[DEBUG]   Imported: org.codehaus.plexus.classworlds < plexus.core
[DEBUG]   Imported: org.codehaus.plexus.component < plexus.core
[DEBUG]   Imported: org.codehaus.plexus.configuration < plexus.core
[DEBUG]   Imported: org.codehaus.plexus.container < plexus.core
[DEBUG]   Imported: org.codehaus.plexus.context < plexus.core
[DEBUG]   Imported: org.codehaus.plexus.lifecycle < plexus.core
[DEBUG]   Imported: org.codehaus.plexus.logging < plexus.core
[DEBUG]   Imported: org.codehaus.plexus.personality < plexus.core
[DEBUG]   Imported: org.codehaus.plexus.util.xml.Xpp3Dom < plexus.core
[DEBUG]   Imported: org.codehaus.plexus.util.xml.pull.XmlPullParser < plexus.core
[DEBUG]   Imported: org.codehaus.plexus.util.xml.pull.XmlPullParserException < plexus.core
[DEBUG]   Imported: org.codehaus.plexus.util.xml.pull.XmlSerializer < plexus.core
[DEBUG]   Imported: org.eclipse.aether.* < plexus.core
[DEBUG]   Imported: org.eclipse.aether.artifact < plexus.core
[DEBUG]   Imported: org.eclipse.aether.collection < plexus.core
[DEBUG]   Imported: org.eclipse.aether.deployment < plexus.core
[DEBUG]   Imported: org.eclipse.aether.graph < plexus.core
[DEBUG]   Imported: org.eclipse.aether.impl < plexus.core
[DEBUG]   Imported: org.eclipse.aether.installation < plexus.core
[DEBUG]   Imported: org.eclipse.aether.internal.impl < plexus.core
[DEBUG]   Imported: org.eclipse.aether.metadata < plexus.core
[DEBUG]   Imported: org.eclipse.aether.repository < plexus.core
[DEBUG]   Imported: org.eclipse.aether.resolution < plexus.core
[DEBUG]   Imported: org.eclipse.aether.spi < plexus.core
[DEBUG]   Imported: org.eclipse.aether.transfer < plexus.core
[DEBUG]   Imported: org.eclipse.aether.version < plexus.core
[DEBUG]   Imported: org.fusesource.jansi.* < plexus.core
[DEBUG]   Imported: org.slf4j.* < plexus.core
[DEBUG]   Imported: org.slf4j.helpers.* < plexus.core
[DEBUG]   Imported: org.slf4j.spi.* < plexus.core
[DEBUG] Populating class realm maven.api
[INFO] Error stacktraces are turned on.
[DEBUG] Message scheme: color
[DEBUG] Message styles: debug info warning error success failure strong mojo project
[DEBUG] Reading global settings from C:\apache-maven-3.5.0\bin\..\conf\settings.xml
[DEBUG] Reading user settings from C:\Users\ufo_bamboo_agent\.m2\settings.xml
[DEBUG] Reading global toolchains from C:\apache-maven-3.5.0\bin\..\conf\toolchains.xml
[DEBUG] Reading user toolchains from C:\Users\ufo_bamboo_agent\.m2\toolchains.xml
[DEBUG] Using local repository at C:\Users\ufo_bamboo_agent\.m2\repository
[DEBUG] Using manager EnhancedLocalRepositoryManager with priority 10.0 for C:\Users\ufo_bamboo_agent\.m2\repository
[INFO] Scanning for projects...
[DEBUG] Extension realms for project com.epam:UFOTests:jar:1.0: (none)
[DEBUG] Looking up lifecycle mappings for packaging jar from ClassRealm[plexus.core, parent: null]
[DEBUG] === REACTOR BUILD PLAN ================================================
[DEBUG] Project: com.epam:UFOTests:jar:1.0
[DEBUG] Tasks:   [test]
[DEBUG] Style:   Regular
[DEBUG] =======================================================================
[INFO] 
[INFO] ------------------------------------------------------------------------
[INFO] Building UFOTests 1.0
[INFO] ------------------------------------------------------------------------
[DEBUG] Lifecycle default -> [validate, initialize, generate-sources, process-sources, generate-resources, process-resources, compile, process-classes, generate-test-sources, process-test-sources, generate-test-resources, process-test-resources, test-compile, process-test-classes, test, prepare-package, package, pre-integration-test, integration-test, post-integration-test, verify, install, deploy]
[DEBUG] Lifecycle clean -> [pre-clean, clean, post-clean]
[DEBUG] Lifecycle site -> [pre-site, site, post-site, site-deploy]
[DEBUG] Lifecycle default -> [validate, initialize, generate-sources, process-sources, generate-resources, process-resources, compile, process-classes, generate-test-sources, process-test-sources, generate-test-resources, process-test-resources, test-compile, process-test-classes, test, prepare-package, package, pre-integration-test, integration-test, post-integration-test, verify, install, deploy]
[DEBUG] Lifecycle clean -> [pre-clean, clean, post-clean]
[DEBUG] Lifecycle site -> [pre-site, site, post-site, site-deploy]
[DEBUG] Lifecycle default -> [validate, initialize, generate-sources, process-sources, generate-resources, process-resources, compile, process-classes, generate-test-sources, process-test-sources, generate-test-resources, process-test-resources, test-compile, process-test-classes, test, prepare-package, package, pre-integration-test, integration-test, post-integration-test, verify, install, deploy]
[DEBUG] Lifecycle clean -> [pre-clean, clean, post-clean]
[DEBUG] Lifecycle site -> [pre-site, site, post-site, site-deploy]
[DEBUG] Lifecycle default -> [validate, initialize, generate-sources, process-sources, generate-resources, process-resources, compile, process-classes, generate-test-sources, process-test-sources, generate-test-resources, process-test-resources, test-compile, process-test-classes, test, prepare-package, package, pre-integration-test, integration-test, post-integration-test, verify, install, deploy]
[DEBUG] Lifecycle clean -> [pre-clean, clean, post-clean]
[DEBUG] Lifecycle site -> [pre-site, site, post-site, site-deploy]
[DEBUG] Lifecycle default -> [validate, initialize, generate-sources, process-sources, generate-resources, process-resources, compile, process-classes, generate-test-sources, process-test-sources, generate-test-resources, process-test-resources, test-compile, process-test-classes, test, prepare-package, package, pre-integration-test, integration-test, post-integration-test, verify, install, deploy]
[DEBUG] Lifecycle clean -> [pre-clean, clean, post-clean]
[DEBUG] Lifecycle site -> [pre-site, site, post-site, site-deploy]
[DEBUG] Lifecycle default -> [validate, initialize, generate-sources, process-sources, generate-resources, process-resources, compile, process-classes, generate-test-sources, process-test-sources, generate-test-resources, process-test-resources, test-compile, process-test-classes, test, prepare-package, package, pre-integration-test, integration-test, post-integration-test, verify, install, deploy]
[DEBUG] Lifecycle clean -> [pre-clean, clean, post-clean]
[DEBUG] Lifecycle site -> [pre-site, site, post-site, site-deploy]
[DEBUG] === PROJECT BUILD PLAN ================================================
[DEBUG] Project:       com.epam:UFOTests:1.0
[DEBUG] Dependencies (collect): []
[DEBUG] Dependencies (resolve): [compile, test]
[DEBUG] Repositories (dependencies): [central (https://repo.maven.apache.org/maven2, default, releases)]
[DEBUG] Repositories (plugins)     : [central (https://repo.maven.apache.org/maven2, default, releases)]
[DEBUG] -----------------------------------------------------------------------
[DEBUG] Goal:          org.apache.maven.plugins:maven-resources-plugin:3.0.2:resources (default-resources)
[DEBUG] Style:         Regular
[DEBUG] Configuration: <?xml version="1.0" encoding="UTF-8"?>
<configuration>
  <addDefaultExcludes default-value="true"/>
  <buildFilters default-value="${project.build.filters}"/>
  <encoding default-value="${project.build.sourceEncoding}">UTF-8</encoding>
  <escapeWindowsPaths default-value="true"/>
  <fileNameFiltering default-value="false"/>
  <includeEmptyDirs default-value="false"/>
  <outputDirectory default-value="${project.build.outputDirectory}"/>
  <overwrite default-value="false"/>
  <project default-value="${project}"/>
  <resources default-value="${project.resources}"/>
  <session default-value="${session}"/>
  <skip default-value="false">${maven.resources.skip}</skip>
  <supportMultiLineFiltering default-value="false"/>
  <useBuildFilters default-value="true"/>
  <useDefaultDelimiters default-value="true"/>
</configuration>
[DEBUG] -----------------------------------------------------------------------
[DEBUG] Goal:          org.apache.maven.plugins:maven-compiler-plugin:3.7.0:compile (default-compile)
[DEBUG] Style:         Regular
[DEBUG] Configuration: <?xml version="1.0" encoding="UTF-8"?>
<configuration>
  <basedir default-value="${basedir}"/>
  <buildDirectory default-value="${project.build.directory}"/>
  <compilePath default-value="${project.compileClasspathElements}"/>
  <compileSourceRoots default-value="${project.compileSourceRoots}"/>
  <compilerId default-value="javac">${maven.compiler.compilerId}</compilerId>
  <compilerReuseStrategy default-value="${reuseCreated}">${maven.compiler.compilerReuseStrategy}</compilerReuseStrategy>
  <compilerVersion>${maven.compiler.compilerVersion}</compilerVersion>
  <debug default-value="true">${maven.compiler.debug}</debug>
  <debuglevel>${maven.compiler.debuglevel}</debuglevel>
  <encoding default-value="${project.build.sourceEncoding}">UTF-8</encoding>
  <executable>${maven.compiler.executable}</executable>
  <failOnError default-value="true">${maven.compiler.failOnError}</failOnError>
  <failOnWarning default-value="false">${maven.compiler.failOnWarning}</failOnWarning>
  <forceJavacCompilerUse default-value="false">${maven.compiler.forceJavacCompilerUse}</forceJavacCompilerUse>
  <fork default-value="false">${maven.compiler.fork}</fork>
  <generatedSourcesDirectory default-value="${project.build.directory}/generated-sources/annotations"/>
  <maxmem>${maven.compiler.maxmem}</maxmem>
  <meminitial>${maven.compiler.meminitial}</meminitial>
  <mojoExecution default-value="${mojoExecution}"/>
  <optimize default-value="false">${maven.compiler.optimize}</optimize>
  <outputDirectory default-value="${project.build.outputDirectory}"/>
  <parameters default-value="false">${maven.compiler.parameters}</parameters>
  <project default-value="${project}"/>
  <projectArtifact default-value="${project.artifact}"/>
  <release>${maven.compiler.release}</release>
  <session default-value="${session}"/>
  <showDeprecation default-value="false">${maven.compiler.showDeprecation}</showDeprecation>
  <showWarnings default-value="false">${maven.compiler.showWarnings}</showWarnings>
  <skipMain>${maven.main.skip}</skipMain>
  <skipMultiThreadWarning default-value="false">${maven.compiler.skipMultiThreadWarning}</skipMultiThreadWarning>
  <source default-value="1.5">1.8</source>
  <staleMillis default-value="0">${lastModGranularityMs}</staleMillis>
  <target default-value="1.5">1.8</target>
  <useIncrementalCompilation default-value="true">${maven.compiler.useIncrementalCompilation}</useIncrementalCompilation>
  <verbose default-value="false">${maven.compiler.verbose}</verbose>
</configuration>
[DEBUG] -----------------------------------------------------------------------
[DEBUG] Goal:          org.apache.maven.plugins:maven-resources-plugin:3.0.2:testResources (default-testResources)
[DEBUG] Style:         Regular
[DEBUG] Configuration: <?xml version="1.0" encoding="UTF-8"?>
<configuration>
  <addDefaultExcludes default-value="true"/>
  <buildFilters default-value="${project.build.filters}"/>
  <encoding default-value="${project.build.sourceEncoding}">UTF-8</encoding>
  <escapeWindowsPaths default-value="true"/>
  <fileNameFiltering default-value="false"/>
  <includeEmptyDirs default-value="false"/>
  <outputDirectory default-value="${project.build.testOutputDirectory}"/>
  <overwrite default-value="false"/>
  <project default-value="${project}"/>
  <resources default-value="${project.testResources}"/>
  <session default-value="${session}"/>
  <skip default-value="false">${maven.test.skip}</skip>
  <supportMultiLineFiltering default-value="false"/>
  <useBuildFilters default-value="true"/>
  <useDefaultDelimiters default-value="true"/>
</configuration>
[DEBUG] -----------------------------------------------------------------------
[DEBUG] Goal:          org.apache.maven.plugins:maven-compiler-plugin:3.7.0:testCompile (default-testCompile)
[DEBUG] Style:         Regular
[DEBUG] Configuration: <?xml version="1.0" encoding="UTF-8"?>
<configuration>
  <basedir default-value="${basedir}"/>
  <buildDirectory default-value="${project.build.directory}"/>
  <compilePath default-value="${project.compileClasspathElements}"/>
  <compileSourceRoots default-value="${project.testCompileSourceRoots}"/>
  <compilerId default-value="javac">${maven.compiler.compilerId}</compilerId>
  <compilerReuseStrategy default-value="${reuseCreated}">${maven.compiler.compilerReuseStrategy}</compilerReuseStrategy>
  <compilerVersion>${maven.compiler.compilerVersion}</compilerVersion>
  <debug default-value="true">${maven.compiler.debug}</debug>
  <debuglevel>${maven.compiler.debuglevel}</debuglevel>
  <encoding default-value="${project.build.sourceEncoding}">UTF-8</encoding>
  <executable>${maven.compiler.executable}</executable>
  <failOnError default-value="true">${maven.compiler.failOnError}</failOnError>
  <failOnWarning default-value="false">${maven.compiler.failOnWarning}</failOnWarning>
  <forceJavacCompilerUse default-value="false">${maven.compiler.forceJavacCompilerUse}</forceJavacCompilerUse>
  <fork default-value="false">${maven.compiler.fork}</fork>
  <generatedTestSourcesDirectory default-value="${project.build.directory}/generated-test-sources/test-annotations"/>
  <maxmem>${maven.compiler.maxmem}</maxmem>
  <meminitial>${maven.compiler.meminitial}</meminitial>
  <mojoExecution default-value="${mojoExecution}"/>
  <optimize default-value="false">${maven.compiler.optimize}</optimize>
  <outputDirectory default-value="${project.build.testOutputDirectory}"/>
  <parameters default-value="false">${maven.compiler.parameters}</parameters>
  <project default-value="${project}"/>
  <release>${maven.compiler.release}</release>
  <session default-value="${session}"/>
  <showDeprecation default-value="false">${maven.compiler.showDeprecation}</showDeprecation>
  <showWarnings default-value="false">${maven.compiler.showWarnings}</showWarnings>
  <skip>${maven.test.skip}</skip>
  <skipMultiThreadWarning default-value="false">${maven.compiler.skipMultiThreadWarning}</skipMultiThreadWarning>
  <source default-value="1.5">1.8</source>
  <staleMillis default-value="0">${lastModGranularityMs}</staleMillis>
  <target default-value="1.5">1.8</target>
  <testPath default-value="${project.testClasspathElements}"/>
  <testRelease>${maven.compiler.testRelease}</testRelease>
  <testSource>${maven.compiler.testSource}</testSource>
  <testTarget>${maven.compiler.testTarget}</testTarget>
  <useIncrementalCompilation default-value="true">${maven.compiler.useIncrementalCompilation}</useIncrementalCompilation>
  <verbose default-value="false">${maven.compiler.verbose}</verbose>
</configuration>
[DEBUG] -----------------------------------------------------------------------
[DEBUG] Goal:          org.apache.maven.plugins:maven-surefire-plugin:2.20.1:test (default-test)
[DEBUG] Style:         Regular
[DEBUG] Configuration: <?xml version="1.0" encoding="UTF-8"?>
<configuration>
  <additionalClasspathElements>${maven.test.additionalClasspath}</additionalClasspathElements>
  <argLine>-Dfile.encoding=UTF-8</argLine>
  <basedir default-value="${basedir}"/>
  <childDelegation default-value="false">${childDelegation}</childDelegation>
  <classesDirectory default-value="${project.build.outputDirectory}"/>
  <classpathDependencyExcludes>${maven.test.dependency.excludes}</classpathDependencyExcludes>
  <debugForkedProcess>${maven.surefire.debug}</debugForkedProcess>
  <dependenciesToScan>${dependenciesToScan}</dependenciesToScan>
  <disableXmlReport default-value="false">${disableXmlReport}</disableXmlReport>
  <enableAssertions default-value="true">${enableAssertions}</enableAssertions>
  <excludedGroups>${excludedGroups}</excludedGroups>
  <excludesFile>${surefire.excludesFile}</excludesFile>
  <failIfNoSpecifiedTests>${surefire.failIfNoSpecifiedTests}</failIfNoSpecifiedTests>
  <failIfNoTests>${failIfNoTests}</failIfNoTests>
  <forkCount default-value="1">${forkCount}</forkCount>
  <forkMode default-value="once">${forkMode}</forkMode>
  <forkedProcessExitTimeoutInSeconds default-value="30">${surefire.exitTimeout}</forkedProcessExitTimeoutInSeconds>
  <forkedProcessTimeoutInSeconds>${surefire.timeout}</forkedProcessTimeoutInSeconds>
  <groups>${groups}</groups>
  <includesFile>${surefire.includesFile}</includesFile>
  <junitArtifactName default-value="junit:junit">${junitArtifactName}</junitArtifactName>
  <jvm>${jvm}</jvm>
  <localRepository default-value="${localRepository}"/>
  <objectFactory>${objectFactory}</objectFactory>
  <parallel>${parallel}</parallel>
  <parallelMavenExecution default-value="${session.parallel}"/>
  <parallelOptimized default-value="true">${parallelOptimized}</parallelOptimized>
  <parallelTestsTimeoutForcedInSeconds>${surefire.parallel.forcedTimeout}</parallelTestsTimeoutForcedInSeconds>
  <parallelTestsTimeoutInSeconds>${surefire.parallel.timeout}</parallelTestsTimeoutInSeconds>
  <perCoreThreadCount default-value="true">${perCoreThreadCount}</perCoreThreadCount>
  <pluginArtifactMap>${plugin.artifactMap}</pluginArtifactMap>
  <pluginDescriptor default-value="${plugin}"/>
  <printSummary default-value="true">${surefire.printSummary}</printSummary>
  <projectArtifactMap>${project.artifactMap}</projectArtifactMap>
  <projectBuildDirectory default-value="${project.build.directory}"/>
  <properties>
    <property>
      <name>listener</name>
      <value>org.uncommons.reportng.HTMLReporter</value>
    </property>
  </properties>
  <redirectTestOutputToFile default-value="false">${maven.test.redirectTestOutputToFile}</redirectTestOutputToFile>
  <remoteRepositories default-value="${project.pluginArtifactRepositories}"/>
  <reportFormat default-value="brief">${surefire.reportFormat}</reportFormat>
  <reportNameSuffix default-value="">${surefire.reportNameSuffix}</reportNameSuffix>
  <reportsDirectory default-value="${project.build.directory}/surefire-reports"/>
  <rerunFailingTestsCount default-value="0">${surefire.rerunFailingTestsCount}</rerunFailingTestsCount>
  <reuseForks default-value="true">${reuseForks}</reuseForks>
  <runOrder default-value="filesystem">${surefire.runOrder}</runOrder>
  <shutdown default-value="testset">${surefire.shutdown}</shutdown>
  <skip default-value="false">false</skip>
  <skipAfterFailureCount default-value="0">${surefire.skipAfterFailureCount}</skipAfterFailureCount>
  <skipExec>${maven.test.skip.exec}</skipExec>
  <skipTests default-value="false">${skipTests}</skipTests>
  <suiteXmlFiles>
    <suiteXmlFile>C:\underwriterTest\actualTests.xml</suiteXmlFile>${surefire.suiteXmlFiles}</suiteXmlFiles>
  <tempDir default-value="surefire">${tempDir}</tempDir>
  <test>${test}</test>
  <testClassesDirectory default-value="${project.build.testOutputDirectory}"/>
  <testFailureIgnore default-value="false">${maven.test.failure.ignore}</testFailureIgnore>
  <testNGArtifactName default-value="org.testng:testng">${testNGArtifactName}</testNGArtifactName>
  <testSourceDirectory default-value="${project.build.testSourceDirectory}"/>
  <threadCount>${threadCount}</threadCount>
  <threadCountClasses default-value="0">${threadCountClasses}</threadCountClasses>
  <threadCountMethods default-value="0">${threadCountMethods}</threadCountMethods>
  <threadCountSuites default-value="0">${threadCountSuites}</threadCountSuites>
  <trimStackTrace default-value="true">${trimStackTrace}</trimStackTrace>
  <useFile default-value="true">${surefire.useFile}</useFile>
  <useManifestOnlyJar default-value="true">${surefire.useManifestOnlyJar}</useManifestOnlyJar>
  <useSystemClassLoader default-value="true">${surefire.useSystemClassLoader}</useSystemClassLoader>
  <useUnlimitedThreads default-value="false">${useUnlimitedThreads}</useUnlimitedThreads>
  <workingDirectory>${basedir}</workingDirectory>
  <project default-value="${project}"/>
  <session default-value="${session}"/>
</configuration>
[DEBUG] =======================================================================
[DEBUG] Could not find metadata org.testng:testng/maven-metadata.xml in local (C:\Users\ufo_bamboo_agent\.m2\repository)
[DEBUG] Skipped remote request for org.testng:testng/maven-metadata.xml, locally cached metadata up-to-date.
[WARNING] The POM for org.testng:testng:jar:5.14.3 is invalid, transitive dependencies (if any) will not be available: 1 problem was encountered while building the effective model for org.testng:testng:5.14.3
[ERROR] 'dependencies.dependency.systemPath' for org.testng:guice:jar must specify an absolute path but is ${basedir}/lib-supplied/guice-2.0.jar @ 

[WARNING] The POM for org.testng:testng:jar:5.14.4 is invalid, transitive dependencies (if any) will not be available: 1 problem was encountered while building the effective model for org.testng:testng:5.14.4
[ERROR] 'dependencies.dependency.systemPath' for org.testng:guice:jar must specify an absolute path but is /Users/cbeust/java/testng/target/checkout/lib-supplied/guice-2.0.jar @ 

[WARNING] The POM for org.testng:testng:jar:5.14.5 is invalid, transitive dependencies (if any) will not be available: 1 problem was encountered while building the effective model for org.testng:testng:5.14.5
[ERROR] 'dependencies.dependency.systemPath' for org.testng:guice:jar must specify an absolute path but is /Users/cbeust/java/testng/target/checkout/lib-supplied/guice-2.0.jar @ 

[DEBUG] Dependency collection stats: {ConflictMarker.analyzeTime=1, ConflictMarker.markTime=1, ConflictMarker.nodeCount=460, ConflictIdSorter.graphTime=1, ConflictIdSorter.topsortTime=0, ConflictIdSorter.conflictIdCount=66, ConflictIdSorter.conflictIdCycleCount=0, ConflictResolver.totalTime=7, ConflictResolver.conflictItemCount=216, DefaultDependencyCollector.collectTime=456, DefaultDependencyCollector.transformTime=12}
[DEBUG] com.epam:UFOTests:jar:1.0
[DEBUG]    org.slf4j:slf4j-api:jar:1.7.25:compile
[DEBUG]    org.slf4j:slf4j-log4j12:jar:1.7.25:compile
[DEBUG]    com.codeborne:selenide:jar:4.8:compile
[DEBUG]       io.github.bonigarcia:webdrivermanager:jar:1.7.2:compile
[DEBUG]          com.typesafe:config:jar:1.2.1:compile
[DEBUG]          org.apache.commons:commons-lang3:jar:3.5:compile
[DEBUG]          org.rauschig:jarchivelib:jar:0.7.1:compile
[DEBUG]             org.apache.commons:commons-compress:jar:1.9:compile
[DEBUG]          org.jsoup:jsoup:jar:1.10.2:compile
[DEBUG]       org.apache.httpcomponents:httpcore:jar:4.4.7:compile
[DEBUG]       org.seleniumhq.selenium:selenium-java:jar:3.6.0:compile
[DEBUG]          org.seleniumhq.selenium:selenium-chrome-driver:jar:3.6.0:compile
[DEBUG]          org.seleniumhq.selenium:selenium-edge-driver:jar:3.6.0:compile
[DEBUG]          org.seleniumhq.selenium:selenium-firefox-driver:jar:3.6.0:compile
[DEBUG]          org.seleniumhq.selenium:selenium-ie-driver:jar:3.6.0:compile
[DEBUG]          org.seleniumhq.selenium:selenium-opera-driver:jar:3.6.0:compile
[DEBUG]       com.google.code.gson:gson:jar:2.8.2:compile
[DEBUG]       com.google.guava:guava:jar:23.0:compile
[DEBUG]          com.google.code.findbugs:jsr305:jar:1.3.9:compile
[DEBUG]          com.google.errorprone:error_prone_annotations:jar:2.0.18:compile
[DEBUG]          com.google.j2objc:j2objc-annotations:jar:1.1:compile
[DEBUG]          org.codehaus.mojo:animal-sniffer-annotations:jar:1.14:compile
[DEBUG]       net.lightbody.bmp:browsermob-core:jar:2.1.5:compile
[DEBUG]          net.lightbody.bmp:littleproxy:jar:1.1.0-beta-bmp-17:compile
[DEBUG]          com.fasterxml.jackson.core:jackson-core:jar:2.8.9:compile
[DEBUG]          com.fasterxml.jackson.core:jackson-databind:jar:2.8.9:compile
[DEBUG]          com.fasterxml.jackson.core:jackson-annotations:jar:2.8.9:compile
[DEBUG]          dnsjava:dnsjava:jar:2.1.8:compile
[DEBUG]          org.slf4j:jcl-over-slf4j:jar:1.7.25:compile
[DEBUG]          com.jcraft:jzlib:jar:1.1.3:compile
[DEBUG]          io.netty:netty-all:jar:4.0.51.Final:compile
[DEBUG]          org.bouncycastle:bcprov-jdk15on:jar:1.58:compile
[DEBUG]          org.bouncycastle:bcpkix-jdk15on:jar:1.58:compile
[DEBUG]          net.lightbody.bmp:mitm:jar:2.1.5:compile
[DEBUG]       com.codeborne:phantomjsdriver:jar:1.4.3:runtime
[DEBUG]       commons-codec:commons-codec:jar:1.10:compile
[DEBUG]    org.seleniumhq.selenium:selenium-support:jar:3.6.0:compile
[DEBUG]       org.seleniumhq.selenium:selenium-api:jar:3.6.0:compile
[DEBUG]       org.seleniumhq.selenium:selenium-remote-driver:jar:3.6.0:compile
[DEBUG]       net.bytebuddy:byte-buddy:jar:1.7.5:compile
[DEBUG]       org.apache.commons:commons-exec:jar:1.3:compile
[DEBUG]       commons-logging:commons-logging:jar:1.2:compile
[DEBUG]       org.apache.httpcomponents:httpclient:jar:4.5.3:compile
[DEBUG]       net.java.dev.jna:jna:jar:4.1.0:compile
[DEBUG]       net.java.dev.jna:jna-platform:jar:4.1.0:compile
[DEBUG]    commons-io:commons-io:jar:2.5:compile
[DEBUG]    org.testng:testng:jar:6.11:compile
[DEBUG]       com.beust:jcommander:jar:1.64:compile
[DEBUG]       org.yaml:snakeyaml:jar:1.17:compile
[DEBUG]    org.uncommons:reportng:jar:1.1.4:compile
[DEBUG]       velocity:velocity:jar:1.4:compile
[DEBUG]          velocity:velocity-dep:jar:1.4:runtime
[DEBUG]    com.microsoft.sqlserver:mssql-jdbc:jar:6.2.2.jre8:compile
[DEBUG]    com.google.inject:guice:jar:4.1.0:compile
[DEBUG]       javax.inject:javax.inject:jar:1:compile
[DEBUG]       aopalliance:aopalliance:jar:1.0:compile
[DEBUG]    log4j:log4j:jar:1.2.17:compile
[DEBUG]    ru.yandex.qatools.ashot:ashot:jar:1.5.4:compile
[DEBUG]       org.hamcrest:hamcrest-core:jar:1.3:compile
[INFO] 
[INFO] --- maven-resources-plugin:3.0.2:resources (default-resources) @ UFOTests ---
[DEBUG] Dependency collection stats: {ConflictMarker.analyzeTime=0, ConflictMarker.markTime=0, ConflictMarker.nodeCount=68, ConflictIdSorter.graphTime=0, ConflictIdSorter.topsortTime=0, ConflictIdSorter.conflictIdCount=28, ConflictIdSorter.conflictIdCycleCount=0, ConflictResolver.totalTime=1, ConflictResolver.conflictItemCount=67, DefaultDependencyCollector.collectTime=99, DefaultDependencyCollector.transformTime=1}
[DEBUG] org.apache.maven.plugins:maven-resources-plugin:jar:3.0.2:
[DEBUG]    org.apache.maven:maven-plugin-api:jar:3.0:compile
[DEBUG]       org.apache.maven:maven-artifact:jar:3.0:compile
[DEBUG]       org.sonatype.sisu:sisu-inject-plexus:jar:1.4.2:compile
[DEBUG]          org.sonatype.sisu:sisu-inject-bean:jar:1.4.2:compile
[DEBUG]             org.sonatype.sisu:sisu-guice:jar:noaop:2.1.7:compile
[DEBUG]    org.apache.maven:maven-core:jar:3.0:compile
[DEBUG]       org.apache.maven:maven-settings:jar:3.0:compile
[DEBUG]       org.apache.maven:maven-settings-builder:jar:3.0:compile
[DEBUG]       org.apache.maven:maven-repository-metadata:jar:3.0:compile
[DEBUG]       org.apache.maven:maven-model-builder:jar:3.0:compile
[DEBUG]       org.apache.maven:maven-aether-provider:jar:3.0:runtime
[DEBUG]       org.sonatype.aether:aether-impl:jar:1.7:compile
[DEBUG]          org.sonatype.aether:aether-spi:jar:1.7:compile
[DEBUG]       org.sonatype.aether:aether-api:jar:1.7:compile
[DEBUG]       org.sonatype.aether:aether-util:jar:1.7:compile
[DEBUG]       org.codehaus.plexus:plexus-classworlds:jar:2.2.3:compile
[DEBUG]       org.codehaus.plexus:plexus-component-annotations:jar:1.6:compile
[DEBUG]       org.sonatype.plexus:plexus-sec-dispatcher:jar:1.3:compile
[DEBUG]          org.sonatype.plexus:plexus-cipher:jar:1.4:compile
[DEBUG]    org.apache.maven:maven-model:jar:3.0:compile
[DEBUG]    org.codehaus.plexus:plexus-utils:jar:3.0.24:compile
[DEBUG]    org.apache.maven.shared:maven-filtering:jar:3.1.1:compile
[DEBUG]       org.apache.maven.shared:maven-shared-utils:jar:3.0.0:compile
[DEBUG]          com.google.code.findbugs:jsr305:jar:2.0.1:compile
[DEBUG]       org.sonatype.plexus:plexus-build-api:jar:0.0.7:compile
[DEBUG]    commons-io:commons-io:jar:2.5:compile
[DEBUG]    org.codehaus.plexus:plexus-interpolation:jar:1.24:compile
[DEBUG] Created new class realm plugin>org.apache.maven.plugins:maven-resources-plugin:3.0.2
[DEBUG] Importing foreign packages into class realm plugin>org.apache.maven.plugins:maven-resources-plugin:3.0.2
[DEBUG]   Imported:  < maven.api
[DEBUG] Populating class realm plugin>org.apache.maven.plugins:maven-resources-plugin:3.0.2
[DEBUG]   Included: org.apache.maven.plugins:maven-resources-plugin:jar:3.0.2
[DEBUG]   Included: org.sonatype.sisu:sisu-inject-bean:jar:1.4.2
[DEBUG]   Included: org.sonatype.sisu:sisu-guice:jar:noaop:2.1.7
[DEBUG]   Included: org.apache.maven:maven-aether-provider:jar:3.0
[DEBUG]   Included: org.sonatype.aether:aether-util:jar:1.7
[DEBUG]   Included: org.codehaus.plexus:plexus-component-annotations:jar:1.6
[DEBUG]   Included: org.sonatype.plexus:plexus-sec-dispatcher:jar:1.3
[DEBUG]   Included: org.sonatype.plexus:plexus-cipher:jar:1.4
[DEBUG]   Included: org.codehaus.plexus:plexus-utils:jar:3.0.24
[DEBUG]   Included: org.apache.maven.shared:maven-filtering:jar:3.1.1
[DEBUG]   Included: org.apache.maven.shared:maven-shared-utils:jar:3.0.0
[DEBUG]   Included: com.google.code.findbugs:jsr305:jar:2.0.1
[DEBUG]   Included: org.sonatype.plexus:plexus-build-api:jar:0.0.7
[DEBUG]   Included: commons-io:commons-io:jar:2.5
[DEBUG]   Included: org.codehaus.plexus:plexus-interpolation:jar:1.24
[DEBUG] Configuring mojo org.apache.maven.plugins:maven-resources-plugin:3.0.2:resources from plugin realm ClassRealm[plugin>org.apache.maven.plugins:maven-resources-plugin:3.0.2, parent: sun.misc.Launcher$AppClassLoader@55f96302]
[DEBUG] Configuring mojo 'org.apache.maven.plugins:maven-resources-plugin:3.0.2:resources' with basic configurator -->
[DEBUG]   (f) addDefaultExcludes = true
[DEBUG]   (f) buildFilters = []
[DEBUG]   (f) encoding = UTF-8
[DEBUG]   (f) escapeWindowsPaths = true
[DEBUG]   (f) fileNameFiltering = false
[DEBUG]   (s) includeEmptyDirs = false
[DEBUG]   (s) outputDirectory = C:\underwriterTest\target\classes
[DEBUG]   (s) overwrite = false
[DEBUG]   (f) project = MavenProject: com.epam:UFOTests:1.0 @ C:\underwriterTest\pom.xml
[DEBUG]   (s) resources = [Resource {targetPath: null, filtering: false, FileSet {directory: C:\underwriterTest\src\main\resources, PatternSet [includes: {}, excludes: {}]}}]
[DEBUG]   (f) session = org.apache.maven.execution.MavenSession@41c62850
[DEBUG]   (f) skip = false
[DEBUG]   (f) supportMultiLineFiltering = false
[DEBUG]   (f) useBuildFilters = true
[DEBUG]   (s) useDefaultDelimiters = true
[DEBUG] -- end configuration --
[DEBUG] properties used {java.vendor=Oracle Corporation, env.SYSTEMROOT=C:\Windows, sun.java.launcher=SUN_STANDARD, sun.management.compiler=HotSpot 64-Bit Tiered Compilers, env.PROMPT=$P$G, env.WDIR=C:\, os.name=Windows 7, env.FP_NO_HOST_CHECK=NO, sun.boot.class.path=C:\Program Files\Java\jdk1.8.0_131\jre\lib\resources.jar;C:\Program Files\Java\jdk1.8.0_131\jre\lib\rt.jar;C:\Program Files\Java\jdk1.8.0_131\jre\lib\sunrsasign.jar;C:\Program Files\Java\jdk1.8.0_131\jre\lib\jsse.jar;C:\Program Files\Java\jdk1.8.0_131\jre\lib\jce.jar;C:\Program Files\Java\jdk1.8.0_131\jre\lib\charsets.jar;C:\Program Files\Java\jdk1.8.0_131\jre\lib\jfr.jar;C:\Program Files\Java\jdk1.8.0_131\jre\classes, env.COMPUTERNAME=UFO-CI-02, env.ALLUSERSPROFILE=C:\ProgramData, sun.desktop=windows, java.vm.specification.vendor=Oracle Corporation, java.runtime.version=1.8.0_131-b11, env.HOMEPATH=\Users\ufo_bamboo_agent, project.build.sourceEncoding=UTF-8, user.name=ufo_bamboo_agent, maven.build.version=Apache Maven 3.5.0 (ff8f5e7444045639af65f6095c62210b5713f426; 2017-04-03T22:39:06+03:00), env.PATH=%SystemRoot%\system32\WindowsPowerShell\v1.0\;C:\ProgramData\Oracle\Java\javapath;C:\Windows\system32;C:\Windows;C:\Windows\System32\Wbem;C:\Windows\System32\WindowsPowerShell\v1.0\;C:\Program Files\TortoiseHg\;C:\Program Files\Microsoft Windows Performance Toolkit\;C:\Program Files (x86)\Microsoft SQL Server\120\Tools\Binn\ManagementStudio\;C:\Program Files (x86)\Microsoft SQL Server\120\Tools\Binn\;C:\Program Files (x86)\Microsoft Visual Studio 12.0\Common7\IDE\PrivateAssemblies\;C:\Program Files (x86)\Microsoft SQL Server\120\DTS\Binn\;C:\Program Files\Microsoft SQL Server\120\Tools\Binn\;C:\Program Files\Microsoft SQL Server\130\Tools\Binn\;C:\Users\ufo_bamboo_agent\.dnx\bin;C:\Program Files\Microsoft DNX\Dnvm\;C:\Program Files (x86)\Windows Kits\8.1\Windows Performance Toolkit\;C:\Windows\System32\WindowsPowerShell\v1.0\;C:\Nuget;C:\Program Files\Microsoft Network Monitor 3\;C:\Program Files (x86)\MSBuild\14.0\Bin\;C:\sonarqube-6.4\sonarqube-6.4\sonar-scanner-msbuild-3.0.0.629\bin;C:\Windows\System32\WindowsPowerShell\v1.0\;C:\Program Files\Git\cmd;C:\apache-maven-3.5.0\bin;C:\apache-maven-3.5.0;C:\Program Files\Java\jdk1.8.0_131\bin;C:\Program Files\dotnet\;C:\Program Files (x86)\dotnet\, user.language=ru, env.JVMCONFIG=\.mvn\jvm.config, env.WINDIR=C:\Windows, sun.boot.library.path=C:\Program Files\Java\jdk1.8.0_131\jre\bin, classworlds.conf=C:\apache-maven-3.5.0\bin\..\bin\m2.conf, java.version=1.8.0_131, env.PROCESSOR_IDENTIFIER=Intel64 Family 6 Model 79 Stepping 1, GenuineIntel, user.timezone=Europe/Moscow, project.baseUri=file:/C:/underwriterTest/, maven.build.timestamp=2017-10-25T15:11:23Z, env.CLIENTNAME=077_67756_001, env.TEMP=C:\Users\UFO_BA~1\AppData\Local\Temp, sun.arch.data.model=64, env.EXEC_DIR=C:\underwriterTest, java.endorsed.dirs=C:\Program Files\Java\jdk1.8.0_131\jre\lib\endorsed, sun.cpu.isalist=amd64, env.HOMEDRIVE=C:, sun.jnu.encoding=Cp1251, file.encoding.pkg=sun.io, env.SYSTEMDRIVE=C:, file.separator=\, java.specification.name=Java Platform API Specification, maven.conf=C:\apache-maven-3.5.0\bin\../conf, env.JAVACMD=C:\Program Files\Java\jdk1.8.0_131\bin\java.exe, java.class.version=52.0, org.slf4j.simpleLogger.defaultLogLevel=debug, user.country=RU, java.home=C:\Program Files\Java\jdk1.8.0_131\jre, env.APPDATA=C:\Users\ufo_bamboo_agent\AppData\Roaming, env.PUBLIC=C:\Users\Public, java.vm.info=mixed mode, env.OS=Windows_NT, os.version=6.1, env.=::=::\, path.separator=;, java.vm.version=25.131-b11, user.variant=, env.USERPROFILE=C:\Users\ufo_bamboo_agent, env.JAVA_HOME=C:\Program Files\Java\jdk1.8.0_131, java.awt.printerjob=sun.awt.windows.WPrinterJob, env.TMP=C:\Users\UFO_BA~1\AppData\Local\Temp, env.PROGRAMFILES=C:\Program Files, sun.io.unicode.encoding=UnicodeLittle, awt.toolkit=sun.awt.windows.WToolkit, user.script=, user.home=C:\Users\ufo_bamboo_agent, env.COMMONPROGRAMFILES=C:\Program Files\Common Files, env.VS140COMNTOOLS=C:\Program Files (x86)\Microsoft Visual Studio 14.0\Common7\Tools\, env.SESSIONNAME=RDP-Tcp#0, java.specification.vendor=Oracle Corporation, env.M2_HOME=C:\apache-maven-3.5.0, java.library.path=C:\Program Files\Java\jdk1.8.0_131\bin;C:\Windows\Sun\Java\bin;C:\Windows\system32;C:\Windows;%SystemRoot%\system32\WindowsPowerShell\v1.0\;C:\ProgramData\Oracle\Java\javapath;C:\Windows\system32;C:\Windows;C:\Windows\System32\Wbem;C:\Windows\System32\WindowsPowerShell\v1.0\;C:\Program Files\TortoiseHg\;C:\Program Files\Microsoft Windows Performance Toolkit\;C:\Program Files (x86)\Microsoft SQL Server\120\Tools\Binn\ManagementStudio\;C:\Program Files (x86)\Microsoft SQL Server\120\Tools\Binn\;C:\Program Files (x86)\Microsoft Visual Studio 12.0\Common7\IDE\PrivateAssemblies\;C:\Program Files (x86)\Microsoft SQL Server\120\DTS\Binn\;C:\Program Files\Microsoft SQL Server\120\Tools\Binn\;C:\Program Files\Microsoft SQL Server\130\Tools\Binn\;C:\Users\ufo_bamboo_agent\.dnx\bin;C:\Program Files\Microsoft DNX\Dnvm\;C:\Program Files (x86)\Windows Kits\8.1\Windows Performance Toolkit\;C:\Windows\System32\WindowsPowerShell\v1.0\;C:\Nuget;C:\Program Files\Microsoft Network Monitor 3\;C:\Program Files (x86)\MSBuild\14.0\Bin\;C:\sonarqube-6.4\sonarqube-6.4\sonar-scanner-msbuild-3.0.0.629\bin;C:\Windows\System32\WindowsPowerShell\v1.0\;C:\Program Files\Git\cmd;C:\apache-maven-3.5.0\bin;C:\apache-maven-3.5.0;C:\Program Files\Java\jdk1.8.0_131\bin;C:\Program Files\dotnet\;C:\Program Files (x86)\dotnet\;., env.NUMBER_OF_PROCESSORS=4, library.jansi.path=C:\apache-maven-3.5.0\bin\..\lib\jansi-native\windows64, java.vendor.url=http://java.oracle.com/, env.CLASSWORLDS_LAUNCHER=org.codehaus.plexus.classworlds.launcher.Launcher, env.PSMODULEPATH=C:\Users\ufo_bamboo_agent\Documents\WindowsPowerShell\Modules;C:\Program Files\WindowsPowerShell\Modules;C:\Windows\system32\WindowsPowerShell\v1.0\Modules\;C:\Program Files (x86)\Microsoft SQL Server\120\Tools\PowerShell\Modules\, env.USERDNSDOMAIN=RGS.RU, env.COMMONPROGRAMFILES(X86)=C:\Program Files (x86)\Common Files, testConfFile=C:\underwriterTest\config\standEpam.properties, env.MAVEN_CMD_LINE_ARGS=test -X -Dsuite=C:\underwriterTest\actualTests.xml -DtestConfFile=C:\underwriterTest\config\standEpam.properties, java.vm.vendor=Oracle Corporation, java.runtime.name=Java(TM) SE Runtime Environment, maven.home=C:\apache-maven-3.5.0\bin\.., java.class.path=C:\apache-maven-3.5.0\bin\..\boot\plexus-classworlds-2.5.2.jar, sun.java.command=org.codehaus.plexus.classworlds.launcher.Launcher test -X -Dsuite=C:\underwriterTest\actualTests.xml -DtestConfFile=C:\underwriterTest\config\standEpam.properties, env.PROGRAMW6432=C:\Program Files, maven.version=3.5.0, env.PROGRAMFILES(X86)=C:\Program Files (x86), java.vm.specification.name=Java Virtual Machine Specification, env.LOGONSERVER=\\RGS-ROOTDC-01, env.PROCESSOR_ARCHITECTURE=AMD64, java.vm.specification.version=1.8, env.COMMONPROGRAMW6432=C:\Program Files\Common Files, sun.os.patch.level=Service Pack 1, sun.cpu.endian=little, suite=C:\underwriterTest\actualTests.xml, env.PROCESSOR_REVISION=4f01, java.io.tmpdir=C:\Users\UFO_BA~1\AppData\Local\Temp\, maven.multiModuleProjectDirectory=C:\underwriterTest, java.vendor.url.bug=http://bugreport.sun.com/bugreport/, env.COMSPEC=C:\Windows\system32\cmd.exe, env.PROGRAMDATA=C:\ProgramData, java.awt.graphicsenv=sun.awt.Win32GraphicsEnvironment, os.arch=amd64, java.ext.dirs=C:\Program Files\Java\jdk1.8.0_131\jre\lib\ext;C:\Windows\Sun\Java\lib\ext, user.dir=C:\underwriterTest, env.LOCALAPPDATA=C:\Users\ufo_bamboo_agent\AppData\Local, env.MAVEN_HOME=C:\apache-maven-3.5.0\bin\.., line.separator=
, java.vm.name=Java HotSpot(TM) 64-Bit Server VM, env.CLASSWORLDS_JAR="C:\apache-maven-3.5.0\bin\..\boot\plexus-classworlds-2.5.2.jar", env.PATHEXT=.COM;.EXE;.BAT;.CMD;.VBS;.VBE;.JS;.JSE;.WSF;.WSH;.MSC;.CPL, env.ERROR_CODE=0, env.M2=C:\apache-maven-3.5.0\bin, env.USERNAME=ufo_bamboo_agent, file.encoding=Cp1251, sun.stderr.encoding=cp866, env.VS100COMNTOOLS=C:\Program Files (x86)\Microsoft Visual Studio 10.0\Common7\Tools\, env.USERDOMAIN=RGSMAIN, java.specification.version=1.8, env.=C:=C:\underwriterTest, env.MAVEN_PROJECTBASEDIR=C:\underwriterTest, env.PROCESSOR_LEVEL=6}
[INFO] Using 'UTF-8' encoding to copy filtered resources.
[DEBUG] resource with targetPath null
directory C:\underwriterTest\src\main\resources
excludes []
includes []
[INFO] skip non existing resourceDirectory C:\underwriterTest\src\main\resources
[DEBUG] no use filter components
[INFO] 
[INFO] --- maven-compiler-plugin:3.7.0:compile (default-compile) @ UFOTests ---
[DEBUG] Dependency collection stats: {ConflictMarker.analyzeTime=0, ConflictMarker.markTime=0, ConflictMarker.nodeCount=118, ConflictIdSorter.graphTime=0, ConflictIdSorter.topsortTime=0, ConflictIdSorter.conflictIdCount=45, ConflictIdSorter.conflictIdCycleCount=0, ConflictResolver.totalTime=2, ConflictResolver.conflictItemCount=72, DefaultDependencyCollector.collectTime=75, DefaultDependencyCollector.transformTime=2}
[DEBUG] org.apache.maven.plugins:maven-compiler-plugin:jar:3.7.0:
[DEBUG]    org.apache.maven:maven-plugin-api:jar:3.0:compile
[DEBUG]       org.apache.maven:maven-model:jar:3.0:compile
[DEBUG]       org.sonatype.sisu:sisu-inject-plexus:jar:1.4.2:compile
[DEBUG]          org.sonatype.sisu:sisu-inject-bean:jar:1.4.2:compile
[DEBUG]             org.sonatype.sisu:sisu-guice:jar:noaop:2.1.7:compile
[DEBUG]    org.apache.maven:maven-artifact:jar:3.0:compile
[DEBUG]       org.codehaus.plexus:plexus-utils:jar:2.0.4:compile
[DEBUG]    org.apache.maven:maven-core:jar:3.0:compile
[DEBUG]       org.apache.maven:maven-settings:jar:3.0:compile
[DEBUG]       org.apache.maven:maven-settings-builder:jar:3.0:compile
[DEBUG]       org.apache.maven:maven-repository-metadata:jar:3.0:compile
[DEBUG]       org.apache.maven:maven-model-builder:jar:3.0:compile
[DEBUG]       org.apache.maven:maven-aether-provider:jar:3.0:runtime
[DEBUG]       org.sonatype.aether:aether-impl:jar:1.7:compile
[DEBUG]          org.sonatype.aether:aether-spi:jar:1.7:compile
[DEBUG]       org.sonatype.aether:aether-api:jar:1.7:compile
[DEBUG]       org.sonatype.aether:aether-util:jar:1.7:compile
[DEBUG]       org.codehaus.plexus:plexus-interpolation:jar:1.14:compile
[DEBUG]       org.codehaus.plexus:plexus-classworlds:jar:2.2.3:compile
[DEBUG]       org.codehaus.plexus:plexus-component-annotations:jar:1.6:compile
[DEBUG]       org.sonatype.plexus:plexus-sec-dispatcher:jar:1.3:compile
[DEBUG]          org.sonatype.plexus:plexus-cipher:jar:1.4:compile
[DEBUG]    org.apache.maven.shared:maven-shared-utils:jar:3.1.0:compile
[DEBUG]       commons-io:commons-io:jar:2.5:compile
[DEBUG]    org.apache.maven.shared:maven-shared-incremental:jar:1.1:compile
[DEBUG]    org.codehaus.plexus:plexus-java:jar:0.9.2:compile
[DEBUG]       org.ow2.asm:asm:jar:6.0_BETA:compile
[DEBUG]       com.thoughtworks.qdox:qdox:jar:2.0-M7:compile
[DEBUG]    org.codehaus.plexus:plexus-compiler-api:jar:2.8.2:compile
[DEBUG]    org.codehaus.plexus:plexus-compiler-manager:jar:2.8.2:compile
[DEBUG]    org.codehaus.plexus:plexus-compiler-javac:jar:2.8.2:runtime
[DEBUG] Created new class realm plugin>org.apache.maven.plugins:maven-compiler-plugin:3.7.0
[DEBUG] Importing foreign packages into class realm plugin>org.apache.maven.plugins:maven-compiler-plugin:3.7.0
[DEBUG]   Imported:  < maven.api
[DEBUG] Populating class realm plugin>org.apache.maven.plugins:maven-compiler-plugin:3.7.0
[DEBUG]   Included: org.apache.maven.plugins:maven-compiler-plugin:jar:3.7.0
[DEBUG]   Included: org.sonatype.sisu:sisu-inject-bean:jar:1.4.2
[DEBUG]   Included: org.sonatype.sisu:sisu-guice:jar:noaop:2.1.7
[DEBUG]   Included: org.codehaus.plexus:plexus-utils:jar:2.0.4
[DEBUG]   Included: org.apache.maven:maven-aether-provider:jar:3.0
[DEBUG]   Included: org.sonatype.aether:aether-util:jar:1.7
[DEBUG]   Included: org.codehaus.plexus:plexus-interpolation:jar:1.14
[DEBUG]   Included: org.codehaus.plexus:plexus-component-annotations:jar:1.6
[DEBUG]   Included: org.sonatype.plexus:plexus-sec-dispatcher:jar:1.3
[DEBUG]   Included: org.sonatype.plexus:plexus-cipher:jar:1.4
[DEBUG]   Included: org.apache.maven.shared:maven-shared-utils:jar:3.1.0
[DEBUG]   Included: commons-io:commons-io:jar:2.5
[DEBUG]   Included: org.apache.maven.shared:maven-shared-incremental:jar:1.1
[DEBUG]   Included: org.codehaus.plexus:plexus-java:jar:0.9.2
[DEBUG]   Included: org.ow2.asm:asm:jar:6.0_BETA
[DEBUG]   Included: com.thoughtworks.qdox:qdox:jar:2.0-M7
[DEBUG]   Included: org.codehaus.plexus:plexus-compiler-api:jar:2.8.2
[DEBUG]   Included: org.codehaus.plexus:plexus-compiler-manager:jar:2.8.2
[DEBUG]   Included: org.codehaus.plexus:plexus-compiler-javac:jar:2.8.2
[DEBUG] Configuring mojo org.apache.maven.plugins:maven-compiler-plugin:3.7.0:compile from plugin realm ClassRealm[plugin>org.apache.maven.plugins:maven-compiler-plugin:3.7.0, parent: sun.misc.Launcher$AppClassLoader@55f96302]
[DEBUG] Configuring mojo 'org.apache.maven.plugins:maven-compiler-plugin:3.7.0:compile' with basic configurator -->
[DEBUG]   (f) basedir = C:\underwriterTest
[DEBUG]   (f) buildDirectory = C:\underwriterTest\target
[DEBUG]   (f) compilePath = [C:\underwriterTest\target\classes, C:\Users\ufo_bamboo_agent\.m2\repository\org\slf4j\slf4j-api\1.7.25\slf4j-api-1.7.25.jar, C:\Users\ufo_bamboo_agent\.m2\repository\org\slf4j\slf4j-log4j12\1.7.25\slf4j-log4j12-1.7.25.jar, C:\Users\ufo_bamboo_agent\.m2\repository\com\codeborne\selenide\4.8\selenide-4.8.jar, C:\Users\ufo_bamboo_agent\.m2\repository\io\github\bonigarcia\webdrivermanager\1.7.2\webdrivermanager-1.7.2.jar, C:\Users\ufo_bamboo_agent\.m2\repository\com\typesafe\config\1.2.1\config-1.2.1.jar, C:\Users\ufo_bamboo_agent\.m2\repository\org\apache\commons\commons-lang3\3.5\commons-lang3-3.5.jar, C:\Users\ufo_bamboo_agent\.m2\repository\org\rauschig\jarchivelib\0.7.1\jarchivelib-0.7.1.jar, C:\Users\ufo_bamboo_agent\.m2\repository\org\apache\commons\commons-compress\1.9\commons-compress-1.9.jar, C:\Users\ufo_bamboo_agent\.m2\repository\org\jsoup\jsoup\1.10.2\jsoup-1.10.2.jar, C:\Users\ufo_bamboo_agent\.m2\repository\org\apache\httpcomponents\httpcore\4.4.7\httpcore-4.4.7.jar, C:\Users\ufo_bamboo_agent\.m2\repository\org\seleniumhq\selenium\selenium-java\3.6.0\selenium-java-3.6.0.jar, C:\Users\ufo_bamboo_agent\.m2\repository\org\seleniumhq\selenium\selenium-chrome-driver\3.6.0\selenium-chrome-driver-3.6.0.jar, C:\Users\ufo_bamboo_agent\.m2\repository\org\seleniumhq\selenium\selenium-edge-driver\3.6.0\selenium-edge-driver-3.6.0.jar, C:\Users\ufo_bamboo_agent\.m2\repository\org\seleniumhq\selenium\selenium-firefox-driver\3.6.0\selenium-firefox-driver-3.6.0.jar, C:\Users\ufo_bamboo_agent\.m2\repository\org\seleniumhq\selenium\selenium-ie-driver\3.6.0\selenium-ie-driver-3.6.0.jar, C:\Users\ufo_bamboo_agent\.m2\repository\org\seleniumhq\selenium\selenium-opera-driver\3.6.0\selenium-opera-driver-3.6.0.jar, C:\Users\ufo_bamboo_agent\.m2\repository\com\google\code\gson\gson\2.8.2\gson-2.8.2.jar, C:\Users\ufo_bamboo_agent\.m2\repository\com\google\guava\guava\23.0\guava-23.0.jar, C:\Users\ufo_bamboo_agent\.m2\repository\com\google\code\findbugs\jsr305\1.3.9\jsr305-1.3.9.jar, C:\Users\ufo_bamboo_agent\.m2\repository\com\google\errorprone\error_prone_annotations\2.0.18\error_prone_annotations-2.0.18.jar, C:\Users\ufo_bamboo_agent\.m2\repository\com\google\j2objc\j2objc-annotations\1.1\j2objc-annotations-1.1.jar, C:\Users\ufo_bamboo_agent\.m2\repository\org\codehaus\mojo\animal-sniffer-annotations\1.14\animal-sniffer-annotations-1.14.jar, C:\Users\ufo_bamboo_agent\.m2\repository\net\lightbody\bmp\browsermob-core\2.1.5\browsermob-core-2.1.5.jar, C:\Users\ufo_bamboo_agent\.m2\repository\net\lightbody\bmp\littleproxy\1.1.0-beta-bmp-17\littleproxy-1.1.0-beta-bmp-17.jar, C:\Users\ufo_bamboo_agent\.m2\repository\com\fasterxml\jackson\core\jackson-core\2.8.9\jackson-core-2.8.9.jar, C:\Users\ufo_bamboo_agent\.m2\repository\com\fasterxml\jackson\core\jackson-databind\2.8.9\jackson-databind-2.8.9.jar, C:\Users\ufo_bamboo_agent\.m2\repository\com\fasterxml\jackson\core\jackson-annotations\2.8.9\jackson-annotations-2.8.9.jar, C:\Users\ufo_bamboo_agent\.m2\repository\dnsjava\dnsjava\2.1.8\dnsjava-2.1.8.jar, C:\Users\ufo_bamboo_agent\.m2\repository\org\slf4j\jcl-over-slf4j\1.7.25\jcl-over-slf4j-1.7.25.jar, C:\Users\ufo_bamboo_agent\.m2\repository\com\jcraft\jzlib\1.1.3\jzlib-1.1.3.jar, C:\Users\ufo_bamboo_agent\.m2\repository\io\netty\netty-all\4.0.51.Final\netty-all-4.0.51.Final.jar, C:\Users\ufo_bamboo_agent\.m2\repository\org\bouncycastle\bcprov-jdk15on\1.58\bcprov-jdk15on-1.58.jar, C:\Users\ufo_bamboo_agent\.m2\repository\org\bouncycastle\bcpkix-jdk15on\1.58\bcpkix-jdk15on-1.58.jar, C:\Users\ufo_bamboo_agent\.m2\repository\net\lightbody\bmp\mitm\2.1.5\mitm-2.1.5.jar, C:\Users\ufo_bamboo_agent\.m2\repository\commons-codec\commons-codec\1.10\commons-codec-1.10.jar, C:\Users\ufo_bamboo_agent\.m2\repository\org\seleniumhq\selenium\selenium-support\3.6.0\selenium-support-3.6.0.jar, C:\Users\ufo_bamboo_agent\.m2\repository\org\seleniumhq\selenium\selenium-api\3.6.0\selenium-api-3.6.0.jar, C:\Users\ufo_bamboo_agent\.m2\repository\org\seleniumhq\selenium\selenium-remote-driver\3.6.0\selenium-remote-driver-3.6.0.jar, C:\Users\ufo_bamboo_agent\.m2\repository\net\bytebuddy\byte-buddy\1.7.5\byte-buddy-1.7.5.jar, C:\Users\ufo_bamboo_agent\.m2\repository\org\apache\commons\commons-exec\1.3\commons-exec-1.3.jar, C:\Users\ufo_bamboo_agent\.m2\repository\commons-logging\commons-logging\1.2\commons-logging-1.2.jar, C:\Users\ufo_bamboo_agent\.m2\repository\org\apache\httpcomponents\httpclient\4.5.3\httpclient-4.5.3.jar, C:\Users\ufo_bamboo_agent\.m2\repository\net\java\dev\jna\jna\4.1.0\jna-4.1.0.jar, C:\Users\ufo_bamboo_agent\.m2\repository\net\java\dev\jna\jna-platform\4.1.0\jna-platform-4.1.0.jar, C:\Users\ufo_bamboo_agent\.m2\repository\commons-io\commons-io\2.5\commons-io-2.5.jar, C:\Users\ufo_bamboo_agent\.m2\repository\org\testng\testng\6.11\testng-6.11.jar, C:\Users\ufo_bamboo_agent\.m2\repository\com\beust\jcommander\1.64\jcommander-1.64.jar, C:\Users\ufo_bamboo_agent\.m2\repository\org\yaml\snakeyaml\1.17\snakeyaml-1.17.jar, C:\Users\ufo_bamboo_agent\.m2\repository\org\uncommons\reportng\1.1.4\reportng-1.1.4.jar, C:\Users\ufo_bamboo_agent\.m2\repository\velocity\velocity\1.4\velocity-1.4.jar, C:\Users\ufo_bamboo_agent\.m2\repository\com\microsoft\sqlserver\mssql-jdbc\6.2.2.jre8\mssql-jdbc-6.2.2.jre8.jar, C:\Users\ufo_bamboo_agent\.m2\repository\com\google\inject\guice\4.1.0\guice-4.1.0.jar, C:\Users\ufo_bamboo_agent\.m2\repository\javax\inject\javax.inject\1\javax.inject-1.jar, C:\Users\ufo_bamboo_agent\.m2\repository\aopalliance\aopalliance\1.0\aopalliance-1.0.jar, C:\Users\ufo_bamboo_agent\.m2\repository\log4j\log4j\1.2.17\log4j-1.2.17.jar, C:\Users\ufo_bamboo_agent\.m2\repository\ru\yandex\qatools\ashot\ashot\1.5.4\ashot-1.5.4.jar, C:\Users\ufo_bamboo_agent\.m2\repository\org\hamcrest\hamcrest-core\1.3\hamcrest-core-1.3.jar]
[DEBUG]   (f) compileSourceRoots = [C:\underwriterTest\src\main\java]
[DEBUG]   (f) compilerId = javac
[DEBUG]   (f) debug = true
[DEBUG]   (f) encoding = UTF-8
[DEBUG]   (f) failOnError = true
[DEBUG]   (f) failOnWarning = false
[DEBUG]   (f) forceJavacCompilerUse = false
[DEBUG]   (f) fork = false
[DEBUG]   (f) generatedSourcesDirectory = C:\underwriterTest\target\generated-sources\annotations
[DEBUG]   (f) mojoExecution = org.apache.maven.plugins:maven-compiler-plugin:3.7.0:compile {execution: default-compile}
[DEBUG]   (f) optimize = false
[DEBUG]   (f) outputDirectory = C:\underwriterTest\target\classes
[DEBUG]   (f) parameters = false
[DEBUG]   (f) project = MavenProject: com.epam:UFOTests:1.0 @ C:\underwriterTest\pom.xml
[DEBUG]   (f) projectArtifact = com.epam:UFOTests:jar:1.0
[DEBUG]   (f) session = org.apache.maven.execution.MavenSession@41c62850
[DEBUG]   (f) showDeprecation = false
[DEBUG]   (f) showWarnings = false
[DEBUG]   (f) skipMultiThreadWarning = false
[DEBUG]   (f) source = 1.8
[DEBUG]   (f) staleMillis = 0
[DEBUG]   (f) target = 1.8
[DEBUG]   (f) useIncrementalCompilation = true
[DEBUG]   (f) verbose = false
[DEBUG] -- end configuration --
[DEBUG] Using compiler 'javac'.
[INFO] No sources to compile
[INFO] 
[INFO] --- maven-resources-plugin:3.0.2:testResources (default-testResources) @ UFOTests ---
[DEBUG] Configuring mojo org.apache.maven.plugins:maven-resources-plugin:3.0.2:testResources from plugin realm ClassRealm[plugin>org.apache.maven.plugins:maven-resources-plugin:3.0.2, parent: sun.misc.Launcher$AppClassLoader@55f96302]
[DEBUG] Configuring mojo 'org.apache.maven.plugins:maven-resources-plugin:3.0.2:testResources' with basic configurator -->
[DEBUG]   (f) addDefaultExcludes = true
[DEBUG]   (f) buildFilters = []
[DEBUG]   (f) encoding = UTF-8
[DEBUG]   (f) escapeWindowsPaths = true
[DEBUG]   (f) fileNameFiltering = false
[DEBUG]   (s) includeEmptyDirs = false
[DEBUG]   (s) outputDirectory = C:\underwriterTest\target\test-classes
[DEBUG]   (s) overwrite = false
[DEBUG]   (f) project = MavenProject: com.epam:UFOTests:1.0 @ C:\underwriterTest\pom.xml
[DEBUG]   (s) resources = [Resource {targetPath: null, filtering: false, FileSet {directory: C:\underwriterTest\src\test\resources, PatternSet [includes: {}, excludes: {}]}}]
[DEBUG]   (f) session = org.apache.maven.execution.MavenSession@41c62850
[DEBUG]   (f) skip = false
[DEBUG]   (f) supportMultiLineFiltering = false
[DEBUG]   (f) useBuildFilters = true
[DEBUG]   (s) useDefaultDelimiters = true
[DEBUG] -- end configuration --
[DEBUG] properties used {java.vendor=Oracle Corporation, env.SYSTEMROOT=C:\Windows, sun.java.launcher=SUN_STANDARD, sun.management.compiler=HotSpot 64-Bit Tiered Compilers, env.PROMPT=$P$G, env.WDIR=C:\, os.name=Windows 7, env.FP_NO_HOST_CHECK=NO, sun.boot.class.path=C:\Program Files\Java\jdk1.8.0_131\jre\lib\resources.jar;C:\Program Files\Java\jdk1.8.0_131\jre\lib\rt.jar;C:\Program Files\Java\jdk1.8.0_131\jre\lib\sunrsasign.jar;C:\Program Files\Java\jdk1.8.0_131\jre\lib\jsse.jar;C:\Program Files\Java\jdk1.8.0_131\jre\lib\jce.jar;C:\Program Files\Java\jdk1.8.0_131\jre\lib\charsets.jar;C:\Program Files\Java\jdk1.8.0_131\jre\lib\jfr.jar;C:\Program Files\Java\jdk1.8.0_131\jre\classes, env.COMPUTERNAME=UFO-CI-02, env.ALLUSERSPROFILE=C:\ProgramData, sun.desktop=windows, java.vm.specification.vendor=Oracle Corporation, java.runtime.version=1.8.0_131-b11, env.HOMEPATH=\Users\ufo_bamboo_agent, project.build.sourceEncoding=UTF-8, user.name=ufo_bamboo_agent, maven.build.version=Apache Maven 3.5.0 (ff8f5e7444045639af65f6095c62210b5713f426; 2017-04-03T22:39:06+03:00), env.PATH=%SystemRoot%\system32\WindowsPowerShell\v1.0\;C:\ProgramData\Oracle\Java\javapath;C:\Windows\system32;C:\Windows;C:\Windows\System32\Wbem;C:\Windows\System32\WindowsPowerShell\v1.0\;C:\Program Files\TortoiseHg\;C:\Program Files\Microsoft Windows Performance Toolkit\;C:\Program Files (x86)\Microsoft SQL Server\120\Tools\Binn\ManagementStudio\;C:\Program Files (x86)\Microsoft SQL Server\120\Tools\Binn\;C:\Program Files (x86)\Microsoft Visual Studio 12.0\Common7\IDE\PrivateAssemblies\;C:\Program Files (x86)\Microsoft SQL Server\120\DTS\Binn\;C:\Program Files\Microsoft SQL Server\120\Tools\Binn\;C:\Program Files\Microsoft SQL Server\130\Tools\Binn\;C:\Users\ufo_bamboo_agent\.dnx\bin;C:\Program Files\Microsoft DNX\Dnvm\;C:\Program Files (x86)\Windows Kits\8.1\Windows Performance Toolkit\;C:\Windows\System32\WindowsPowerShell\v1.0\;C:\Nuget;C:\Program Files\Microsoft Network Monitor 3\;C:\Program Files (x86)\MSBuild\14.0\Bin\;C:\sonarqube-6.4\sonarqube-6.4\sonar-scanner-msbuild-3.0.0.629\bin;C:\Windows\System32\WindowsPowerShell\v1.0\;C:\Program Files\Git\cmd;C:\apache-maven-3.5.0\bin;C:\apache-maven-3.5.0;C:\Program Files\Java\jdk1.8.0_131\bin;C:\Program Files\dotnet\;C:\Program Files (x86)\dotnet\, user.language=ru, env.JVMCONFIG=\.mvn\jvm.config, env.WINDIR=C:\Windows, sun.boot.library.path=C:\Program Files\Java\jdk1.8.0_131\jre\bin, classworlds.conf=C:\apache-maven-3.5.0\bin\..\bin\m2.conf, java.version=1.8.0_131, env.PROCESSOR_IDENTIFIER=Intel64 Family 6 Model 79 Stepping 1, GenuineIntel, user.timezone=Europe/Moscow, project.baseUri=file:/C:/underwriterTest/, maven.build.timestamp=2017-10-25T15:11:23Z, env.CLIENTNAME=077_67756_001, env.TEMP=C:\Users\UFO_BA~1\AppData\Local\Temp, sun.arch.data.model=64, env.EXEC_DIR=C:\underwriterTest, java.endorsed.dirs=C:\Program Files\Java\jdk1.8.0_131\jre\lib\endorsed, sun.cpu.isalist=amd64, env.HOMEDRIVE=C:, sun.jnu.encoding=Cp1251, file.encoding.pkg=sun.io, env.SYSTEMDRIVE=C:, file.separator=\, java.specification.name=Java Platform API Specification, maven.conf=C:\apache-maven-3.5.0\bin\../conf, env.JAVACMD=C:\Program Files\Java\jdk1.8.0_131\bin\java.exe, java.class.version=52.0, org.slf4j.simpleLogger.defaultLogLevel=debug, user.country=RU, java.home=C:\Program Files\Java\jdk1.8.0_131\jre, env.APPDATA=C:\Users\ufo_bamboo_agent\AppData\Roaming, env.PUBLIC=C:\Users\Public, java.vm.info=mixed mode, env.OS=Windows_NT, os.version=6.1, env.=::=::\, path.separator=;, java.vm.version=25.131-b11, user.variant=, env.USERPROFILE=C:\Users\ufo_bamboo_agent, env.JAVA_HOME=C:\Program Files\Java\jdk1.8.0_131, java.awt.printerjob=sun.awt.windows.WPrinterJob, env.TMP=C:\Users\UFO_BA~1\AppData\Local\Temp, env.PROGRAMFILES=C:\Program Files, sun.io.unicode.encoding=UnicodeLittle, awt.toolkit=sun.awt.windows.WToolkit, user.script=, user.home=C:\Users\ufo_bamboo_agent, env.COMMONPROGRAMFILES=C:\Program Files\Common Files, env.VS140COMNTOOLS=C:\Program Files (x86)\Microsoft Visual Studio 14.0\Common7\Tools\, env.SESSIONNAME=RDP-Tcp#0, java.specification.vendor=Oracle Corporation, env.M2_HOME=C:\apache-maven-3.5.0, java.library.path=C:\Program Files\Java\jdk1.8.0_131\bin;C:\Windows\Sun\Java\bin;C:\Windows\system32;C:\Windows;%SystemRoot%\system32\WindowsPowerShell\v1.0\;C:\ProgramData\Oracle\Java\javapath;C:\Windows\system32;C:\Windows;C:\Windows\System32\Wbem;C:\Windows\System32\WindowsPowerShell\v1.0\;C:\Program Files\TortoiseHg\;C:\Program Files\Microsoft Windows Performance Toolkit\;C:\Program Files (x86)\Microsoft SQL Server\120\Tools\Binn\ManagementStudio\;C:\Program Files (x86)\Microsoft SQL Server\120\Tools\Binn\;C:\Program Files (x86)\Microsoft Visual Studio 12.0\Common7\IDE\PrivateAssemblies\;C:\Program Files (x86)\Microsoft SQL Server\120\DTS\Binn\;C:\Program Files\Microsoft SQL Server\120\Tools\Binn\;C:\Program Files\Microsoft SQL Server\130\Tools\Binn\;C:\Users\ufo_bamboo_agent\.dnx\bin;C:\Program Files\Microsoft DNX\Dnvm\;C:\Program Files (x86)\Windows Kits\8.1\Windows Performance Toolkit\;C:\Windows\System32\WindowsPowerShell\v1.0\;C:\Nuget;C:\Program Files\Microsoft Network Monitor 3\;C:\Program Files (x86)\MSBuild\14.0\Bin\;C:\sonarqube-6.4\sonarqube-6.4\sonar-scanner-msbuild-3.0.0.629\bin;C:\Windows\System32\WindowsPowerShell\v1.0\;C:\Program Files\Git\cmd;C:\apache-maven-3.5.0\bin;C:\apache-maven-3.5.0;C:\Program Files\Java\jdk1.8.0_131\bin;C:\Program Files\dotnet\;C:\Program Files (x86)\dotnet\;., env.NUMBER_OF_PROCESSORS=4, library.jansi.path=C:\apache-maven-3.5.0\bin\..\lib\jansi-native\windows64, java.vendor.url=http://java.oracle.com/, env.CLASSWORLDS_LAUNCHER=org.codehaus.plexus.classworlds.launcher.Launcher, env.PSMODULEPATH=C:\Users\ufo_bamboo_agent\Documents\WindowsPowerShell\Modules;C:\Program Files\WindowsPowerShell\Modules;C:\Windows\system32\WindowsPowerShell\v1.0\Modules\;C:\Program Files (x86)\Microsoft SQL Server\120\Tools\PowerShell\Modules\, env.USERDNSDOMAIN=RGS.RU, env.COMMONPROGRAMFILES(X86)=C:\Program Files (x86)\Common Files, testConfFile=C:\underwriterTest\config\standEpam.properties, env.MAVEN_CMD_LINE_ARGS=test -X -Dsuite=C:\underwriterTest\actualTests.xml -DtestConfFile=C:\underwriterTest\config\standEpam.properties, java.vm.vendor=Oracle Corporation, java.runtime.name=Java(TM) SE Runtime Environment, maven.home=C:\apache-maven-3.5.0\bin\.., java.class.path=C:\apache-maven-3.5.0\bin\..\boot\plexus-classworlds-2.5.2.jar, sun.java.command=org.codehaus.plexus.classworlds.launcher.Launcher test -X -Dsuite=C:\underwriterTest\actualTests.xml -DtestConfFile=C:\underwriterTest\config\standEpam.properties, env.PROGRAMW6432=C:\Program Files, maven.version=3.5.0, env.PROGRAMFILES(X86)=C:\Program Files (x86), java.vm.specification.name=Java Virtual Machine Specification, env.LOGONSERVER=\\RGS-ROOTDC-01, env.PROCESSOR_ARCHITECTURE=AMD64, java.vm.specification.version=1.8, env.COMMONPROGRAMW6432=C:\Program Files\Common Files, sun.os.patch.level=Service Pack 1, sun.cpu.endian=little, suite=C:\underwriterTest\actualTests.xml, env.PROCESSOR_REVISION=4f01, java.io.tmpdir=C:\Users\UFO_BA~1\AppData\Local\Temp\, maven.multiModuleProjectDirectory=C:\underwriterTest, java.vendor.url.bug=http://bugreport.sun.com/bugreport/, env.COMSPEC=C:\Windows\system32\cmd.exe, env.PROGRAMDATA=C:\ProgramData, java.awt.graphicsenv=sun.awt.Win32GraphicsEnvironment, os.arch=amd64, java.ext.dirs=C:\Program Files\Java\jdk1.8.0_131\jre\lib\ext;C:\Windows\Sun\Java\lib\ext, user.dir=C:\underwriterTest, env.LOCALAPPDATA=C:\Users\ufo_bamboo_agent\AppData\Local, env.MAVEN_HOME=C:\apache-maven-3.5.0\bin\.., line.separator=
, java.vm.name=Java HotSpot(TM) 64-Bit Server VM, env.CLASSWORLDS_JAR="C:\apache-maven-3.5.0\bin\..\boot\plexus-classworlds-2.5.2.jar", env.PATHEXT=.COM;.EXE;.BAT;.CMD;.VBS;.VBE;.JS;.JSE;.WSF;.WSH;.MSC;.CPL, env.ERROR_CODE=0, env.M2=C:\apache-maven-3.5.0\bin, env.USERNAME=ufo_bamboo_agent, file.encoding=Cp1251, sun.stderr.encoding=cp866, env.VS100COMNTOOLS=C:\Program Files (x86)\Microsoft Visual Studio 10.0\Common7\Tools\, env.USERDOMAIN=RGSMAIN, java.specification.version=1.8, env.=C:=C:\underwriterTest, env.MAVEN_PROJECTBASEDIR=C:\underwriterTest, env.PROCESSOR_LEVEL=6}
[INFO] Using 'UTF-8' encoding to copy filtered resources.
[DEBUG] resource with targetPath null
directory C:\underwriterTest\src\test\resources
excludes []
includes []
[DEBUG] ignoreDelta true
[INFO] Copying 280 resources
[DEBUG] Copying file att_3542.txt
[DEBUG] file att_3542.txt has a filtered file extension
[DEBUG] copy C:\underwriterTest\src\test\resources\att_3542.txt to C:\underwriterTest\target\test-classes\att_3542.txt
[DEBUG] Copying file att_3548.txt
[DEBUG] file att_3548.txt has a filtered file extension
[DEBUG] copy C:\underwriterTest\src\test\resources\att_3548.txt to C:\underwriterTest\target\test-classes\att_3548.txt
[DEBUG] Copying file att_4028.txt
[DEBUG] file att_4028.txt has a filtered file extension
[DEBUG] copy C:\underwriterTest\src\test\resources\att_4028.txt to C:\underwriterTest\target\test-classes\att_4028.txt
[DEBUG] Copying file calc\calc_1312.txt
[DEBUG] file calc_1312.txt has a filtered file extension
[DEBUG] copy C:\underwriterTest\src\test\resources\calc\calc_1312.txt to C:\underwriterTest\target\test-classes\calc\calc_1312.txt
[DEBUG] Copying file calc\calc_1317.txt
[DEBUG] file calc_1317.txt has a filtered file extension
[DEBUG] copy C:\underwriterTest\src\test\resources\calc\calc_1317.txt to C:\underwriterTest\target\test-classes\calc\calc_1317.txt
[DEBUG] Copying file calc\calc_1322.txt
[DEBUG] file calc_1322.txt has a filtered file extension
[DEBUG] copy C:\underwriterTest\src\test\resources\calc\calc_1322.txt to C:\underwriterTest\target\test-classes\calc\calc_1322.txt
[DEBUG] Copying file calc\calc_1323.txt
[DEBUG] file calc_1323.txt has a filtered file extension
[DEBUG] copy C:\underwriterTest\src\test\resources\calc\calc_1323.txt to C:\underwriterTest\target\test-classes\calc\calc_1323.txt
[DEBUG] Copying file calc\calc_1324.txt
[DEBUG] file calc_1324.txt has a filtered file extension
[DEBUG] copy C:\underwriterTest\src\test\resources\calc\calc_1324.txt to C:\underwriterTest\target\test-classes\calc\calc_1324.txt
[DEBUG] Copying file calc\calc_1326.txt
[DEBUG] file calc_1326.txt has a filtered file extension
[DEBUG] copy C:\underwriterTest\src\test\resources\calc\calc_1326.txt to C:\underwriterTest\target\test-classes\calc\calc_1326.txt
[DEBUG] Copying file calc\calc_1392.txt
[DEBUG] file calc_1392.txt has a filtered file extension
[DEBUG] copy C:\underwriterTest\src\test\resources\calc\calc_1392.txt to C:\underwriterTest\target\test-classes\calc\calc_1392.txt
[DEBUG] Copying file calc\calc_1393.txt
[DEBUG] file calc_1393.txt has a filtered file extension
[DEBUG] copy C:\underwriterTest\src\test\resources\calc\calc_1393.txt to C:\underwriterTest\target\test-classes\calc\calc_1393.txt
[DEBUG] Copying file calc\calc_1395.txt
[DEBUG] file calc_1395.txt has a filtered file extension
[DEBUG] copy C:\underwriterTest\src\test\resources\calc\calc_1395.txt to C:\underwriterTest\target\test-classes\calc\calc_1395.txt
[DEBUG] Copying file calc\calc_1397.txt
[DEBUG] file calc_1397.txt has a filtered file extension
[DEBUG] copy C:\underwriterTest\src\test\resources\calc\calc_1397.txt to C:\underwriterTest\target\test-classes\calc\calc_1397.txt
[DEBUG] Copying file calc\calc_1398.txt
[DEBUG] file calc_1398.txt has a filtered file extension
[DEBUG] copy C:\underwriterTest\src\test\resources\calc\calc_1398.txt to C:\underwriterTest\target\test-classes\calc\calc_1398.txt
[DEBUG] Copying file calc\calc_1402.txt
[DEBUG] file calc_1402.txt has a filtered file extension
[DEBUG] copy C:\underwriterTest\src\test\resources\calc\calc_1402.txt to C:\underwriterTest\target\test-classes\calc\calc_1402.txt
[DEBUG] Copying file calc\calc_1403.txt
[DEBUG] file calc_1403.txt has a filtered file extension
[DEBUG] copy C:\underwriterTest\src\test\resources\calc\calc_1403.txt to C:\underwriterTest\target\test-classes\calc\calc_1403.txt
[DEBUG] Copying file calc\calc_1495.txt
[DEBUG] file calc_1495.txt has a filtered file extension
[DEBUG] copy C:\underwriterTest\src\test\resources\calc\calc_1495.txt to C:\underwriterTest\target\test-classes\calc\calc_1495.txt
[DEBUG] Copying file calc\calc_1496.txt
[DEBUG] file calc_1496.txt has a filtered file extension
[DEBUG] copy C:\underwriterTest\src\test\resources\calc\calc_1496.txt to C:\underwriterTest\target\test-classes\calc\calc_1496.txt
[DEBUG] Copying file calc\calc_1514.txt
[DEBUG] file calc_1514.txt has a filtered file extension
[DEBUG] copy C:\underwriterTest\src\test\resources\calc\calc_1514.txt to C:\underwriterTest\target\test-classes\calc\calc_1514.txt
[DEBUG] Copying file calc\calc_1523.txt
[DEBUG] file calc_1523.txt has a filtered file extension
[DEBUG] copy C:\underwriterTest\src\test\resources\calc\calc_1523.txt to C:\underwriterTest\target\test-classes\calc\calc_1523.txt
[DEBUG] Copying file calc\calc_1528.txt
[DEBUG] file calc_1528.txt has a filtered file extension
[DEBUG] copy C:\underwriterTest\src\test\resources\calc\calc_1528.txt to C:\underwriterTest\target\test-classes\calc\calc_1528.txt
[DEBUG] Copying file calc\calc_1550.txt
[DEBUG] file calc_1550.txt has a filtered file extension
[DEBUG] copy C:\underwriterTest\src\test\resources\calc\calc_1550.txt to C:\underwriterTest\target\test-classes\calc\calc_1550.txt
[DEBUG] Copying file calc\calc_1558.txt
[DEBUG] file calc_1558.txt has a filtered file extension
[DEBUG] copy C:\underwriterTest\src\test\resources\calc\calc_1558.txt to C:\underwriterTest\target\test-classes\calc\calc_1558.txt
[DEBUG] Copying file calc\calc_1563.txt
[DEBUG] file calc_1563.txt has a filtered file extension
[DEBUG] copy C:\underwriterTest\src\test\resources\calc\calc_1563.txt to C:\underwriterTest\target\test-classes\calc\calc_1563.txt
[DEBUG] Copying file calc\calc_1565.txt
[DEBUG] file calc_1565.txt has a filtered file extension
[DEBUG] copy C:\underwriterTest\src\test\resources\calc\calc_1565.txt to C:\underwriterTest\target\test-classes\calc\calc_1565.txt
[DEBUG] Copying file calc\calc_1583.txt
[DEBUG] file calc_1583.txt has a filtered file extension
[DEBUG] copy C:\underwriterTest\src\test\resources\calc\calc_1583.txt to C:\underwriterTest\target\test-classes\calc\calc_1583.txt
[DEBUG] Copying file calc\calc_1585.txt
[DEBUG] file calc_1585.txt has a filtered file extension
[DEBUG] copy C:\underwriterTest\src\test\resources\calc\calc_1585.txt to C:\underwriterTest\target\test-classes\calc\calc_1585.txt
[DEBUG] Copying file calc\calc_1609.txt
[DEBUG] file calc_1609.txt has a filtered file extension
[DEBUG] copy C:\underwriterTest\src\test\resources\calc\calc_1609.txt to C:\underwriterTest\target\test-classes\calc\calc_1609.txt
[DEBUG] Copying file calc\calc_1611.txt
[DEBUG] file calc_1611.txt has a filtered file extension
[DEBUG] copy C:\underwriterTest\src\test\resources\calc\calc_1611.txt to C:\underwriterTest\target\test-classes\calc\calc_1611.txt
[DEBUG] Copying file calc\calc_1615.txt
[DEBUG] file calc_1615.txt has a filtered file extension
[DEBUG] copy C:\underwriterTest\src\test\resources\calc\calc_1615.txt to C:\underwriterTest\target\test-classes\calc\calc_1615.txt
[DEBUG] Copying file calc\calc_1617.txt
[DEBUG] file calc_1617.txt has a filtered file extension
[DEBUG] copy C:\underwriterTest\src\test\resources\calc\calc_1617.txt to C:\underwriterTest\target\test-classes\calc\calc_1617.txt
[DEBUG] Copying file calc\calc_1624.txt
[DEBUG] file calc_1624.txt has a filtered file extension
[DEBUG] copy C:\underwriterTest\src\test\resources\calc\calc_1624.txt to C:\underwriterTest\target\test-classes\calc\calc_1624.txt
[DEBUG] Copying file calc\calc_1625.txt
[DEBUG] file calc_1625.txt has a filtered file extension
[DEBUG] copy C:\underwriterTest\src\test\resources\calc\calc_1625.txt to C:\underwriterTest\target\test-classes\calc\calc_1625.txt
[DEBUG] Copying file calc\calc_1711.txt
[DEBUG] file calc_1711.txt has a filtered file extension
[DEBUG] copy C:\underwriterTest\src\test\resources\calc\calc_1711.txt to C:\underwriterTest\target\test-classes\calc\calc_1711.txt
[DEBUG] Copying file calc\calc_1713.txt
[DEBUG] file calc_1713.txt has a filtered file extension
[DEBUG] copy C:\underwriterTest\src\test\resources\calc\calc_1713.txt to C:\underwriterTest\target\test-classes\calc\calc_1713.txt
[DEBUG] Copying file calc\calc_1736.txt
[DEBUG] file calc_1736.txt has a filtered file extension
[DEBUG] copy C:\underwriterTest\src\test\resources\calc\calc_1736.txt to C:\underwriterTest\target\test-classes\calc\calc_1736.txt
[DEBUG] Copying file calc\calc_1737.txt
[DEBUG] file calc_1737.txt has a filtered file extension
[DEBUG] copy C:\underwriterTest\src\test\resources\calc\calc_1737.txt to C:\underwriterTest\target\test-classes\calc\calc_1737.txt
[DEBUG] Copying file calc\calc_1804.txt
[DEBUG] file calc_1804.txt has a filtered file extension
[DEBUG] copy C:\underwriterTest\src\test\resources\calc\calc_1804.txt to C:\underwriterTest\target\test-classes\calc\calc_1804.txt
[DEBUG] Copying file calc\calc_1806.txt
[DEBUG] file calc_1806.txt has a filtered file extension
[DEBUG] copy C:\underwriterTest\src\test\resources\calc\calc_1806.txt to C:\underwriterTest\target\test-classes\calc\calc_1806.txt
[DEBUG] Copying file calc\calc_1807.txt
[DEBUG] file calc_1807.txt has a filtered file extension
[DEBUG] copy C:\underwriterTest\src\test\resources\calc\calc_1807.txt to C:\underwriterTest\target\test-classes\calc\calc_1807.txt
[DEBUG] Copying file calc\calc_1808.txt
[DEBUG] file calc_1808.txt has a filtered file extension
[DEBUG] copy C:\underwriterTest\src\test\resources\calc\calc_1808.txt to C:\underwriterTest\target\test-classes\calc\calc_1808.txt
[DEBUG] Copying file calc\calc_1809.txt
[DEBUG] file calc_1809.txt has a filtered file extension
[DEBUG] copy C:\underwriterTest\src\test\resources\calc\calc_1809.txt to C:\underwriterTest\target\test-classes\calc\calc_1809.txt
[DEBUG] Copying file calc\calc_1810.txt
[DEBUG] file calc_1810.txt has a filtered file extension
[DEBUG] copy C:\underwriterTest\src\test\resources\calc\calc_1810.txt to C:\underwriterTest\target\test-classes\calc\calc_1810.txt
[DEBUG] Copying file calc\calc_1811.txt
[DEBUG] file calc_1811.txt has a filtered file extension
[DEBUG] copy C:\underwriterTest\src\test\resources\calc\calc_1811.txt to C:\underwriterTest\target\test-classes\calc\calc_1811.txt
[DEBUG] Copying file calc\calc_1812.txt
[DEBUG] file calc_1812.txt has a filtered file extension
[DEBUG] copy C:\underwriterTest\src\test\resources\calc\calc_1812.txt to C:\underwriterTest\target\test-classes\calc\calc_1812.txt
[DEBUG] Copying file calc\calc_1813.txt
[DEBUG] file calc_1813.txt has a filtered file extension
[DEBUG] copy C:\underwriterTest\src\test\resources\calc\calc_1813.txt to C:\underwriterTest\target\test-classes\calc\calc_1813.txt
[DEBUG] Copying file calc\calc_1814.txt
[DEBUG] file calc_1814.txt has a filtered file extension
[DEBUG] copy C:\underwriterTest\src\test\resources\calc\calc_1814.txt to C:\underwriterTest\target\test-classes\calc\calc_1814.txt
[DEBUG] Copying file calc\calc_1815.txt
[DEBUG] file calc_1815.txt has a filtered file extension
[DEBUG] copy C:\underwriterTest\src\test\resources\calc\calc_1815.txt to C:\underwriterTest\target\test-classes\calc\calc_1815.txt
[DEBUG] Copying file calc\calc_1817.txt
[DEBUG] file calc_1817.txt has a filtered file extension
[DEBUG] copy C:\underwriterTest\src\test\resources\calc\calc_1817.txt to C:\underwriterTest\target\test-classes\calc\calc_1817.txt
[DEBUG] Copying file calc\calc_1818.txt
[DEBUG] file calc_1818.txt has a filtered file extension
[DEBUG] copy C:\underwriterTest\src\test\resources\calc\calc_1818.txt to C:\underwriterTest\target\test-classes\calc\calc_1818.txt
[DEBUG] Copying file calc\calc_1819.txt
[DEBUG] file calc_1819.txt has a filtered file extension
[DEBUG] copy C:\underwriterTest\src\test\resources\calc\calc_1819.txt to C:\underwriterTest\target\test-classes\calc\calc_1819.txt
[DEBUG] Copying file calc\calc_1821.txt
[DEBUG] file calc_1821.txt has a filtered file extension
[DEBUG] copy C:\underwriterTest\src\test\resources\calc\calc_1821.txt to C:\underwriterTest\target\test-classes\calc\calc_1821.txt
[DEBUG] Copying file calc\calc_1822.txt
[DEBUG] file calc_1822.txt has a filtered file extension
[DEBUG] copy C:\underwriterTest\src\test\resources\calc\calc_1822.txt to C:\underwriterTest\target\test-classes\calc\calc_1822.txt
[DEBUG] Copying file calc\calc_1823.txt
[DEBUG] file calc_1823.txt has a filtered file extension
[DEBUG] copy C:\underwriterTest\src\test\resources\calc\calc_1823.txt to C:\underwriterTest\target\test-classes\calc\calc_1823.txt
[DEBUG] Copying file calc\calc_1824.txt
[DEBUG] file calc_1824.txt has a filtered file extension
[DEBUG] copy C:\underwriterTest\src\test\resources\calc\calc_1824.txt to C:\underwriterTest\target\test-classes\calc\calc_1824.txt
[DEBUG] Copying file calc\calc_1825.txt
[DEBUG] file calc_1825.txt has a filtered file extension
[DEBUG] copy C:\underwriterTest\src\test\resources\calc\calc_1825.txt to C:\underwriterTest\target\test-classes\calc\calc_1825.txt
[DEBUG] Copying file calc\calc_1826.txt
[DEBUG] file calc_1826.txt has a filtered file extension
[DEBUG] copy C:\underwriterTest\src\test\resources\calc\calc_1826.txt to C:\underwriterTest\target\test-classes\calc\calc_1826.txt
[DEBUG] Copying file calc\calc_1828.txt
[DEBUG] file calc_1828.txt has a filtered file extension
[DEBUG] copy C:\underwriterTest\src\test\resources\calc\calc_1828.txt to C:\underwriterTest\target\test-classes\calc\calc_1828.txt
[DEBUG] Copying file calc\calc_1829.txt
[DEBUG] file calc_1829.txt has a filtered file extension
[DEBUG] copy C:\underwriterTest\src\test\resources\calc\calc_1829.txt to C:\underwriterTest\target\test-classes\calc\calc_1829.txt
[DEBUG] Copying file calc\calc_1830.txt
[DEBUG] file calc_1830.txt has a filtered file extension
[DEBUG] copy C:\underwriterTest\src\test\resources\calc\calc_1830.txt to C:\underwriterTest\target\test-classes\calc\calc_1830.txt
[DEBUG] Copying file calc\calc_1832.txt
[DEBUG] file calc_1832.txt has a filtered file extension
[DEBUG] copy C:\underwriterTest\src\test\resources\calc\calc_1832.txt to C:\underwriterTest\target\test-classes\calc\calc_1832.txt
[DEBUG] Copying file calc\calc_1839.txt
[DEBUG] file calc_1839.txt has a filtered file extension
[DEBUG] copy C:\underwriterTest\src\test\resources\calc\calc_1839.txt to C:\underwriterTest\target\test-classes\calc\calc_1839.txt
[DEBUG] Copying file calc\calc_1840.txt
[DEBUG] file calc_1840.txt has a filtered file extension
[DEBUG] copy C:\underwriterTest\src\test\resources\calc\calc_1840.txt to C:\underwriterTest\target\test-classes\calc\calc_1840.txt
[DEBUG] Copying file calc\calc_1841.txt
[DEBUG] file calc_1841.txt has a filtered file extension
[DEBUG] copy C:\underwriterTest\src\test\resources\calc\calc_1841.txt to C:\underwriterTest\target\test-classes\calc\calc_1841.txt
[DEBUG] Copying file calc\calc_1867.txt
[DEBUG] file calc_1867.txt has a filtered file extension
[DEBUG] copy C:\underwriterTest\src\test\resources\calc\calc_1867.txt to C:\underwriterTest\target\test-classes\calc\calc_1867.txt
[DEBUG] Copying file calc\calc_1868.txt
[DEBUG] file calc_1868.txt has a filtered file extension
[DEBUG] copy C:\underwriterTest\src\test\resources\calc\calc_1868.txt to C:\underwriterTest\target\test-classes\calc\calc_1868.txt
[DEBUG] Copying file calc\calc_1879.txt
[DEBUG] file calc_1879.txt has a filtered file extension
[DEBUG] copy C:\underwriterTest\src\test\resources\calc\calc_1879.txt to C:\underwriterTest\target\test-classes\calc\calc_1879.txt
[DEBUG] Copying file calc\calc_1891.txt
[DEBUG] file calc_1891.txt has a filtered file extension
[DEBUG] copy C:\underwriterTest\src\test\resources\calc\calc_1891.txt to C:\underwriterTest\target\test-classes\calc\calc_1891.txt
[DEBUG] Copying file calc\calc_1892.txt
[DEBUG] file calc_1892.txt has a filtered file extension
[DEBUG] copy C:\underwriterTest\src\test\resources\calc\calc_1892.txt to C:\underwriterTest\target\test-classes\calc\calc_1892.txt
[DEBUG] Copying file calc\calc_1949.txt
[DEBUG] file calc_1949.txt has a filtered file extension
[DEBUG] copy C:\underwriterTest\src\test\resources\calc\calc_1949.txt to C:\underwriterTest\target\test-classes\calc\calc_1949.txt
[DEBUG] Copying file calc\calc_2052.txt
[DEBUG] file calc_2052.txt has a filtered file extension
[DEBUG] copy C:\underwriterTest\src\test\resources\calc\calc_2052.txt to C:\underwriterTest\target\test-classes\calc\calc_2052.txt
[DEBUG] Copying file calc\calc_2193.txt
[DEBUG] file calc_2193.txt has a filtered file extension
[DEBUG] copy C:\underwriterTest\src\test\resources\calc\calc_2193.txt to C:\underwriterTest\target\test-classes\calc\calc_2193.txt
[DEBUG] Copying file calc\calc_2196.txt
[DEBUG] file calc_2196.txt has a filtered file extension
[DEBUG] copy C:\underwriterTest\src\test\resources\calc\calc_2196.txt to C:\underwriterTest\target\test-classes\calc\calc_2196.txt
[DEBUG] Copying file calc\calc_2197.txt
[DEBUG] file calc_2197.txt has a filtered file extension
[DEBUG] copy C:\underwriterTest\src\test\resources\calc\calc_2197.txt to C:\underwriterTest\target\test-classes\calc\calc_2197.txt
[DEBUG] Copying file calc\calc_2198.txt
[DEBUG] file calc_2198.txt has a filtered file extension
[DEBUG] copy C:\underwriterTest\src\test\resources\calc\calc_2198.txt to C:\underwriterTest\target\test-classes\calc\calc_2198.txt
[DEBUG] Copying file calc\calc_2200.txt
[DEBUG] file calc_2200.txt has a filtered file extension
[DEBUG] copy C:\underwriterTest\src\test\resources\calc\calc_2200.txt to C:\underwriterTest\target\test-classes\calc\calc_2200.txt
[DEBUG] Copying file calc\calc_2201.txt
[DEBUG] file calc_2201.txt has a filtered file extension
[DEBUG] copy C:\underwriterTest\src\test\resources\calc\calc_2201.txt to C:\underwriterTest\target\test-classes\calc\calc_2201.txt
[DEBUG] Copying file calc\calc_2244.txt
[DEBUG] file calc_2244.txt has a filtered file extension
[DEBUG] copy C:\underwriterTest\src\test\resources\calc\calc_2244.txt to C:\underwriterTest\target\test-classes\calc\calc_2244.txt
[DEBUG] Copying file calc\calc_2245.txt
[DEBUG] file calc_2245.txt has a filtered file extension
[DEBUG] copy C:\underwriterTest\src\test\resources\calc\calc_2245.txt to C:\underwriterTest\target\test-classes\calc\calc_2245.txt
[DEBUG] Copying file calc\calc_2250.txt
[DEBUG] file calc_2250.txt has a filtered file extension
[DEBUG] copy C:\underwriterTest\src\test\resources\calc\calc_2250.txt to C:\underwriterTest\target\test-classes\calc\calc_2250.txt
[DEBUG] Copying file calc\calc_2255.txt
[DEBUG] file calc_2255.txt has a filtered file extension
[DEBUG] copy C:\underwriterTest\src\test\resources\calc\calc_2255.txt to C:\underwriterTest\target\test-classes\calc\calc_2255.txt
[DEBUG] Copying file calc\calc_2256.txt
[DEBUG] file calc_2256.txt has a filtered file extension
[DEBUG] copy C:\underwriterTest\src\test\resources\calc\calc_2256.txt to C:\underwriterTest\target\test-classes\calc\calc_2256.txt
[DEBUG] Copying file calc\calc_2261.txt
[DEBUG] file calc_2261.txt has a filtered file extension
[DEBUG] copy C:\underwriterTest\src\test\resources\calc\calc_2261.txt to C:\underwriterTest\target\test-classes\calc\calc_2261.txt
[DEBUG] Copying file calc\calc_2262.txt
[DEBUG] file calc_2262.txt has a filtered file extension
[DEBUG] copy C:\underwriterTest\src\test\resources\calc\calc_2262.txt to C:\underwriterTest\target\test-classes\calc\calc_2262.txt
[DEBUG] Copying file calc\calc_2263.txt
[DEBUG] file calc_2263.txt has a filtered file extension
[DEBUG] copy C:\underwriterTest\src\test\resources\calc\calc_2263.txt to C:\underwriterTest\target\test-classes\calc\calc_2263.txt
[DEBUG] Copying file calc\calc_2268.txt
[DEBUG] file calc_2268.txt has a filtered file extension
[DEBUG] copy C:\underwriterTest\src\test\resources\calc\calc_2268.txt to C:\underwriterTest\target\test-classes\calc\calc_2268.txt
[DEBUG] Copying file calc\calc_2269.txt
[DEBUG] file calc_2269.txt has a filtered file extension
[DEBUG] copy C:\underwriterTest\src\test\resources\calc\calc_2269.txt to C:\underwriterTest\target\test-classes\calc\calc_2269.txt
[DEBUG] Copying file calc\calc_3266.txt
[DEBUG] file calc_3266.txt has a filtered file extension
[DEBUG] copy C:\underwriterTest\src\test\resources\calc\calc_3266.txt to C:\underwriterTest\target\test-classes\calc\calc_3266.txt
[DEBUG] Copying file calc\calc_3267.txt
[DEBUG] file calc_3267.txt has a filtered file extension
[DEBUG] copy C:\underwriterTest\src\test\resources\calc\calc_3267.txt to C:\underwriterTest\target\test-classes\calc\calc_3267.txt
[DEBUG] Copying file calc\calc_3268.txt
[DEBUG] file calc_3268.txt has a filtered file extension
[DEBUG] copy C:\underwriterTest\src\test\resources\calc\calc_3268.txt to C:\underwriterTest\target\test-classes\calc\calc_3268.txt
[DEBUG] Copying file calc\calc_3285.txt
[DEBUG] file calc_3285.txt has a filtered file extension
[DEBUG] copy C:\underwriterTest\src\test\resources\calc\calc_3285.txt to C:\underwriterTest\target\test-classes\calc\calc_3285.txt
[DEBUG] Copying file calc\calc_4199.txt
[DEBUG] file calc_4199.txt has a filtered file extension
[DEBUG] copy C:\underwriterTest\src\test\resources\calc\calc_4199.txt to C:\underwriterTest\target\test-classes\calc\calc_4199.txt
[DEBUG] Copying file calc\calc_4200.txt
[DEBUG] file calc_4200.txt has a filtered file extension
[DEBUG] copy C:\underwriterTest\src\test\resources\calc\calc_4200.txt to C:\underwriterTest\target\test-classes\calc\calc_4200.txt
[DEBUG] Copying file calc\calc_4216.txt
[DEBUG] file calc_4216.txt has a filtered file extension
[DEBUG] copy C:\underwriterTest\src\test\resources\calc\calc_4216.txt to C:\underwriterTest\target\test-classes\calc\calc_4216.txt
[DEBUG] Copying file calc\calc_4217.txt
[DEBUG] file calc_4217.txt has a filtered file extension
[DEBUG] copy C:\underwriterTest\src\test\resources\calc\calc_4217.txt to C:\underwriterTest\target\test-classes\calc\calc_4217.txt
[DEBUG] Copying file calc\calc_4289.txt
[DEBUG] file calc_4289.txt has a filtered file extension
[DEBUG] copy C:\underwriterTest\src\test\resources\calc\calc_4289.txt to C:\underwriterTest\target\test-classes\calc\calc_4289.txt
[DEBUG] Copying file calc\calc_4376.txt
[DEBUG] file calc_4376.txt has a filtered file extension
[DEBUG] copy C:\underwriterTest\src\test\resources\calc\calc_4376.txt to C:\underwriterTest\target\test-classes\calc\calc_4376.txt
[DEBUG] Copying file calc\calc_4378.txt
[DEBUG] file calc_4378.txt has a filtered file extension
[DEBUG] copy C:\underwriterTest\src\test\resources\calc\calc_4378.txt to C:\underwriterTest\target\test-classes\calc\calc_4378.txt
[DEBUG] Copying file calc\calc_4384.txt
[DEBUG] file calc_4384.txt has a filtered file extension
[DEBUG] copy C:\underwriterTest\src\test\resources\calc\calc_4384.txt to C:\underwriterTest\target\test-classes\calc\calc_4384.txt
[DEBUG] Copying file calc\calc_4385.txt
[DEBUG] file calc_4385.txt has a filtered file extension
[DEBUG] copy C:\underwriterTest\src\test\resources\calc\calc_4385.txt to C:\underwriterTest\target\test-classes\calc\calc_4385.txt
[DEBUG] Copying file calc\calc_4435.txt
[DEBUG] file calc_4435.txt has a filtered file extension
[DEBUG] copy C:\underwriterTest\src\test\resources\calc\calc_4435.txt to C:\underwriterTest\target\test-classes\calc\calc_4435.txt
[DEBUG] Copying file calc\calc_4436.txt
[DEBUG] file calc_4436.txt has a filtered file extension
[DEBUG] copy C:\underwriterTest\src\test\resources\calc\calc_4436.txt to C:\underwriterTest\target\test-classes\calc\calc_4436.txt
[DEBUG] Copying file calc\calc_4437.txt
[DEBUG] file calc_4437.txt has a filtered file extension
[DEBUG] copy C:\underwriterTest\src\test\resources\calc\calc_4437.txt to C:\underwriterTest\target\test-classes\calc\calc_4437.txt
[DEBUG] Copying file calc\calc_4438.txt
[DEBUG] file calc_4438.txt has a filtered file extension
[DEBUG] copy C:\underwriterTest\src\test\resources\calc\calc_4438.txt to C:\underwriterTest\target\test-classes\calc\calc_4438.txt
[DEBUG] Copying file calc\calc_4444.txt
[DEBUG] file calc_4444.txt has a filtered file extension
[DEBUG] copy C:\underwriterTest\src\test\resources\calc\calc_4444.txt to C:\underwriterTest\target\test-classes\calc\calc_4444.txt
[DEBUG] Copying file calc\calc_4445.txt
[DEBUG] file calc_4445.txt has a filtered file extension
[DEBUG] copy C:\underwriterTest\src\test\resources\calc\calc_4445.txt to C:\underwriterTest\target\test-classes\calc\calc_4445.txt
[DEBUG] Copying file calc\calc_4446.txt
[DEBUG] file calc_4446.txt has a filtered file extension
[DEBUG] copy C:\underwriterTest\src\test\resources\calc\calc_4446.txt to C:\underwriterTest\target\test-classes\calc\calc_4446.txt
[DEBUG] Copying file calc\calc_4448.txt
[DEBUG] file calc_4448.txt has a filtered file extension
[DEBUG] copy C:\underwriterTest\src\test\resources\calc\calc_4448.txt to C:\underwriterTest\target\test-classes\calc\calc_4448.txt
[DEBUG] Copying file calc\calc_4537.txt
[DEBUG] file calc_4537.txt has a filtered file extension
[DEBUG] copy C:\underwriterTest\src\test\resources\calc\calc_4537.txt to C:\underwriterTest\target\test-classes\calc\calc_4537.txt
[DEBUG] Copying file calc\calc_4539.txt
[DEBUG] file calc_4539.txt has a filtered file extension
[DEBUG] copy C:\underwriterTest\src\test\resources\calc\calc_4539.txt to C:\underwriterTest\target\test-classes\calc\calc_4539.txt
[DEBUG] Copying file calc\calc_4542.txt
[DEBUG] file calc_4542.txt has a filtered file extension
[DEBUG] copy C:\underwriterTest\src\test\resources\calc\calc_4542.txt to C:\underwriterTest\target\test-classes\calc\calc_4542.txt
[DEBUG] Copying file calc\calc_4543.txt
[DEBUG] file calc_4543.txt has a filtered file extension
[DEBUG] copy C:\underwriterTest\src\test\resources\calc\calc_4543.txt to C:\underwriterTest\target\test-classes\calc\calc_4543.txt
[DEBUG] Copying file calc\calc_4545.txt
[DEBUG] file calc_4545.txt has a filtered file extension
[DEBUG] copy C:\underwriterTest\src\test\resources\calc\calc_4545.txt to C:\underwriterTest\target\test-classes\calc\calc_4545.txt
[DEBUG] Copying file calc\calc_4591.txt
[DEBUG] file calc_4591.txt has a filtered file extension
[DEBUG] copy C:\underwriterTest\src\test\resources\calc\calc_4591.txt to C:\underwriterTest\target\test-classes\calc\calc_4591.txt
[DEBUG] Copying file calc\calc_4712.txt
[DEBUG] file calc_4712.txt has a filtered file extension
[DEBUG] copy C:\underwriterTest\src\test\resources\calc\calc_4712.txt to C:\underwriterTest\target\test-classes\calc\calc_4712.txt
[DEBUG] Copying file calc\calc_4749_1.txt
[DEBUG] file calc_4749_1.txt has a filtered file extension
[DEBUG] copy C:\underwriterTest\src\test\resources\calc\calc_4749_1.txt to C:\underwriterTest\target\test-classes\calc\calc_4749_1.txt
[DEBUG] Copying file calc\calc_4749_3.txt
[DEBUG] file calc_4749_3.txt has a filtered file extension
[DEBUG] copy C:\underwriterTest\src\test\resources\calc\calc_4749_3.txt to C:\underwriterTest\target\test-classes\calc\calc_4749_3.txt
[DEBUG] Copying file calc\calc_4752_1.txt
[DEBUG] file calc_4752_1.txt has a filtered file extension
[DEBUG] copy C:\underwriterTest\src\test\resources\calc\calc_4752_1.txt to C:\underwriterTest\target\test-classes\calc\calc_4752_1.txt
[DEBUG] Copying file calc\calc_4752_3.txt
[DEBUG] file calc_4752_3.txt has a filtered file extension
[DEBUG] copy C:\underwriterTest\src\test\resources\calc\calc_4752_3.txt to C:\underwriterTest\target\test-classes\calc\calc_4752_3.txt
[DEBUG] Copying file calc\calc_4753_2.txt
[DEBUG] file calc_4753_2.txt has a filtered file extension
[DEBUG] copy C:\underwriterTest\src\test\resources\calc\calc_4753_2.txt to C:\underwriterTest\target\test-classes\calc\calc_4753_2.txt
[DEBUG] Copying file calc\calc_4756_1.txt
[DEBUG] file calc_4756_1.txt has a filtered file extension
[DEBUG] copy C:\underwriterTest\src\test\resources\calc\calc_4756_1.txt to C:\underwriterTest\target\test-classes\calc\calc_4756_1.txt
[DEBUG] Copying file calc\calc_4756_2.txt
[DEBUG] file calc_4756_2.txt has a filtered file extension
[DEBUG] copy C:\underwriterTest\src\test\resources\calc\calc_4756_2.txt to C:\underwriterTest\target\test-classes\calc\calc_4756_2.txt
[DEBUG] Copying file calc\calc_4757_1.txt
[DEBUG] file calc_4757_1.txt has a filtered file extension
[DEBUG] copy C:\underwriterTest\src\test\resources\calc\calc_4757_1.txt to C:\underwriterTest\target\test-classes\calc\calc_4757_1.txt
[DEBUG] Copying file calc\calc_4757_2.txt
[DEBUG] file calc_4757_2.txt has a filtered file extension
[DEBUG] copy C:\underwriterTest\src\test\resources\calc\calc_4757_2.txt to C:\underwriterTest\target\test-classes\calc\calc_4757_2.txt
[DEBUG] Copying file calc\calc_4759_1.txt
[DEBUG] file calc_4759_1.txt has a filtered file extension
[DEBUG] copy C:\underwriterTest\src\test\resources\calc\calc_4759_1.txt to C:\underwriterTest\target\test-classes\calc\calc_4759_1.txt
[DEBUG] Copying file calc\calc_4759_2.txt
[DEBUG] file calc_4759_2.txt has a filtered file extension
[DEBUG] copy C:\underwriterTest\src\test\resources\calc\calc_4759_2.txt to C:\underwriterTest\target\test-classes\calc\calc_4759_2.txt
[DEBUG] Copying file calc\calc_4760_3.txt
[DEBUG] file calc_4760_3.txt has a filtered file extension
[DEBUG] copy C:\underwriterTest\src\test\resources\calc\calc_4760_3.txt to C:\underwriterTest\target\test-classes\calc\calc_4760_3.txt
[DEBUG] Copying file calc\calc_4762_1.txt
[DEBUG] file calc_4762_1.txt has a filtered file extension
[DEBUG] copy C:\underwriterTest\src\test\resources\calc\calc_4762_1.txt to C:\underwriterTest\target\test-classes\calc\calc_4762_1.txt
[DEBUG] Copying file calc\calc_4762_2.txt
[DEBUG] file calc_4762_2.txt has a filtered file extension
[DEBUG] copy C:\underwriterTest\src\test\resources\calc\calc_4762_2.txt to C:\underwriterTest\target\test-classes\calc\calc_4762_2.txt
[DEBUG] Copying file calc\calc_npd_5194.txt
[DEBUG] file calc_npd_5194.txt has a filtered file extension
[DEBUG] copy C:\underwriterTest\src\test\resources\calc\calc_npd_5194.txt to C:\underwriterTest\target\test-classes\calc\calc_npd_5194.txt
[DEBUG] Copying file calc\calc_ntd_4601_1.txt
[DEBUG] file calc_ntd_4601_1.txt has a filtered file extension
[DEBUG] copy C:\underwriterTest\src\test\resources\calc\calc_ntd_4601_1.txt to C:\underwriterTest\target\test-classes\calc\calc_ntd_4601_1.txt
[DEBUG] Copying file calc\calc_ntd_4601_2.txt
[DEBUG] file calc_ntd_4601_2.txt has a filtered file extension
[DEBUG] copy C:\underwriterTest\src\test\resources\calc\calc_ntd_4601_2.txt to C:\underwriterTest\target\test-classes\calc\calc_ntd_4601_2.txt
[DEBUG] Copying file calc\calc_ntd_4607.txt
[DEBUG] file calc_ntd_4607.txt has a filtered file extension
[DEBUG] copy C:\underwriterTest\src\test\resources\calc\calc_ntd_4607.txt to C:\underwriterTest\target\test-classes\calc\calc_ntd_4607.txt
[DEBUG] Copying file calc\calc_ntd_4608.txt
[DEBUG] file calc_ntd_4608.txt has a filtered file extension
[DEBUG] copy C:\underwriterTest\src\test\resources\calc\calc_ntd_4608.txt to C:\underwriterTest\target\test-classes\calc\calc_ntd_4608.txt
[DEBUG] Copying file calc\calc_ntd_4609.txt
[DEBUG] file calc_ntd_4609.txt has a filtered file extension
[DEBUG] copy C:\underwriterTest\src\test\resources\calc\calc_ntd_4609.txt to C:\underwriterTest\target\test-classes\calc\calc_ntd_4609.txt
[DEBUG] Copying file calc\calc_ntd_4610.txt
[DEBUG] file calc_ntd_4610.txt has a filtered file extension
[DEBUG] copy C:\underwriterTest\src\test\resources\calc\calc_ntd_4610.txt to C:\underwriterTest\target\test-classes\calc\calc_ntd_4610.txt
[DEBUG] Copying file checkStatus.txt
[DEBUG] file checkStatus.txt has a filtered file extension
[DEBUG] copy C:\underwriterTest\src\test\resources\checkStatus.txt to C:\underwriterTest\target\test-classes\checkStatus.txt
[DEBUG] Copying file cos_3542.txt
[DEBUG] file cos_3542.txt has a filtered file extension
[DEBUG] copy C:\underwriterTest\src\test\resources\cos_3542.txt to C:\underwriterTest\target\test-classes\cos_3542.txt
[DEBUG] Copying file gen\gen_1919.txt
[DEBUG] file gen_1919.txt has a filtered file extension
[DEBUG] copy C:\underwriterTest\src\test\resources\gen\gen_1919.txt to C:\underwriterTest\target\test-classes\gen\gen_1919.txt
[DEBUG] Copying file gen\gen_1920.txt
[DEBUG] file gen_1920.txt has a filtered file extension
[DEBUG] copy C:\underwriterTest\src\test\resources\gen\gen_1920.txt to C:\underwriterTest\target\test-classes\gen\gen_1920.txt
[DEBUG] Copying file gen\gen_1922.txt
[DEBUG] file gen_1922.txt has a filtered file extension
[DEBUG] copy C:\underwriterTest\src\test\resources\gen\gen_1922.txt to C:\underwriterTest\target\test-classes\gen\gen_1922.txt
[DEBUG] Copying file gen\gen_1932.txt
[DEBUG] file gen_1932.txt has a filtered file extension
[DEBUG] copy C:\underwriterTest\src\test\resources\gen\gen_1932.txt to C:\underwriterTest\target\test-classes\gen\gen_1932.txt
[DEBUG] Copying file gen\gen_1933.txt
[DEBUG] file gen_1933.txt has a filtered file extension
[DEBUG] copy C:\underwriterTest\src\test\resources\gen\gen_1933.txt to C:\underwriterTest\target\test-classes\gen\gen_1933.txt
[DEBUG] Copying file gen\gen_1935.txt
[DEBUG] file gen_1935.txt has a filtered file extension
[DEBUG] copy C:\underwriterTest\src\test\resources\gen\gen_1935.txt to C:\underwriterTest\target\test-classes\gen\gen_1935.txt
[DEBUG] Copying file gen\gen_1936.txt
[DEBUG] file gen_1936.txt has a filtered file extension
[DEBUG] copy C:\underwriterTest\src\test\resources\gen\gen_1936.txt to C:\underwriterTest\target\test-classes\gen\gen_1936.txt
[DEBUG] Copying file gen\gen_1971.txt
[DEBUG] file gen_1971.txt has a filtered file extension
[DEBUG] copy C:\underwriterTest\src\test\resources\gen\gen_1971.txt to C:\underwriterTest\target\test-classes\gen\gen_1971.txt
[DEBUG] Copying file gen\gen_1972.txt
[DEBUG] file gen_1972.txt has a filtered file extension
[DEBUG] copy C:\underwriterTest\src\test\resources\gen\gen_1972.txt to C:\underwriterTest\target\test-classes\gen\gen_1972.txt
[DEBUG] Copying file gen\gen_1973.txt
[DEBUG] file gen_1973.txt has a filtered file extension
[DEBUG] copy C:\underwriterTest\src\test\resources\gen\gen_1973.txt to C:\underwriterTest\target\test-classes\gen\gen_1973.txt
[DEBUG] Copying file log4j.xml
[DEBUG] file log4j.xml has a filtered file extension
[DEBUG] copy C:\underwriterTest\src\test\resources\log4j.xml to C:\underwriterTest\target\test-classes\log4j.xml
[DEBUG] Copying file print\print_4760_1.txt
[DEBUG] file print_4760_1.txt has a filtered file extension
[DEBUG] copy C:\underwriterTest\src\test\resources\print\print_4760_1.txt to C:\underwriterTest\target\test-classes\print\print_4760_1.txt
[DEBUG] Copying file print\print_4760_3.txt
[DEBUG] file print_4760_3.txt has a filtered file extension
[DEBUG] copy C:\underwriterTest\src\test\resources\print\print_4760_3.txt to C:\underwriterTest\target\test-classes\print\print_4760_3.txt
[DEBUG] Copying file reportportal-client-v2.jks
[DEBUG] file reportportal-client-v2.jks has a filtered file extension
[DEBUG] copy C:\underwriterTest\src\test\resources\reportportal-client-v2.jks to C:\underwriterTest\target\test-classes\reportportal-client-v2.jks
[DEBUG] Copying file reportportal.properties
[DEBUG] file reportportal.properties has a filtered file extension
[DEBUG] copy C:\underwriterTest\src\test\resources\reportportal.properties to C:\underwriterTest\target\test-classes\reportportal.properties
[DEBUG] Copying file repository\com\epam\reportportal\agent-java-testng\2.7.0\agent-java-testng-2.7.0.jar.sha1
[DEBUG] file agent-java-testng-2.7.0.jar.sha1 has a filtered file extension
[DEBUG] copy C:\underwriterTest\src\test\resources\repository\com\epam\reportportal\agent-java-testng\2.7.0\agent-java-testng-2.7.0.jar.sha1 to C:\underwriterTest\target\test-classes\repository\com\epam\reportportal\agent-java-testng\2.7.0\agent-java-testng-2.7.0.jar.sha1
[DEBUG] Copying file repository\com\epam\reportportal\agent-java-testng\2.7.0\agent-java-testng-2.7.0.pom
[DEBUG] file agent-java-testng-2.7.0.pom has a filtered file extension
[DEBUG] copy C:\underwriterTest\src\test\resources\repository\com\epam\reportportal\agent-java-testng\2.7.0\agent-java-testng-2.7.0.pom to C:\underwriterTest\target\test-classes\repository\com\epam\reportportal\agent-java-testng\2.7.0\agent-java-testng-2.7.0.pom
[DEBUG] Copying file repository\com\epam\reportportal\agent-java-testng\2.7.0\agent-java-testng-2.7.0.pom.sha1
[DEBUG] file agent-java-testng-2.7.0.pom.sha1 has a filtered file extension
[DEBUG] copy C:\underwriterTest\src\test\resources\repository\com\epam\reportportal\agent-java-testng\2.7.0\agent-java-testng-2.7.0.pom.sha1 to C:\underwriterTest\target\test-classes\repository\com\epam\reportportal\agent-java-testng\2.7.0\agent-java-testng-2.7.0.pom.sha1
[DEBUG] Copying file repository\com\epam\reportportal\agent-java-testng\2.7.0\_remote.repositories
[DEBUG] file _remote.repositories has a filtered file extension
[DEBUG] copy C:\underwriterTest\src\test\resources\repository\com\epam\reportportal\agent-java-testng\2.7.0\_remote.repositories to C:\underwriterTest\target\test-classes\repository\com\epam\reportportal\agent-java-testng\2.7.0\_remote.repositories
[DEBUG] Copying file repository\com\epam\reportportal\client-java-core\2.5.1\client-java-core-2.5.1.pom
[DEBUG] file client-java-core-2.5.1.pom has a filtered file extension
[DEBUG] copy C:\underwriterTest\src\test\resources\repository\com\epam\reportportal\client-java-core\2.5.1\client-java-core-2.5.1.pom to C:\underwriterTest\target\test-classes\repository\com\epam\reportportal\client-java-core\2.5.1\client-java-core-2.5.1.pom
[DEBUG] Copying file repository\com\epam\reportportal\client-java-core\2.5.1\client-java-core-2.5.1.pom.sha1
[DEBUG] file client-java-core-2.5.1.pom.sha1 has a filtered file extension
[DEBUG] copy C:\underwriterTest\src\test\resources\repository\com\epam\reportportal\client-java-core\2.5.1\client-java-core-2.5.1.pom.sha1 to C:\underwriterTest\target\test-classes\repository\com\epam\reportportal\client-java-core\2.5.1\client-java-core-2.5.1.pom.sha1
[DEBUG] Copying file repository\com\epam\reportportal\client-java-core\2.5.1\_remote.repositories
[DEBUG] file _remote.repositories has a filtered file extension
[DEBUG] copy C:\underwriterTest\src\test\resources\repository\com\epam\reportportal\client-java-core\2.5.1\_remote.repositories to C:\underwriterTest\target\test-classes\repository\com\epam\reportportal\client-java-core\2.5.1\_remote.repositories
[DEBUG] Copying file repository\com\epam\reportportal\client-java-core\2.7.0\client-java-core-2.7.0.jar.sha1
[DEBUG] file client-java-core-2.7.0.jar.sha1 has a filtered file extension
[DEBUG] copy C:\underwriterTest\src\test\resources\repository\com\epam\reportportal\client-java-core\2.7.0\client-java-core-2.7.0.jar.sha1 to C:\underwriterTest\target\test-classes\repository\com\epam\reportportal\client-java-core\2.7.0\client-java-core-2.7.0.jar.sha1
[DEBUG] Copying file repository\com\epam\reportportal\client-java-core\2.7.0\client-java-core-2.7.0.pom
[DEBUG] file client-java-core-2.7.0.pom has a filtered file extension
[DEBUG] copy C:\underwriterTest\src\test\resources\repository\com\epam\reportportal\client-java-core\2.7.0\client-java-core-2.7.0.pom to C:\underwriterTest\target\test-classes\repository\com\epam\reportportal\client-java-core\2.7.0\client-java-core-2.7.0.pom
[DEBUG] Copying file repository\com\epam\reportportal\client-java-core\2.7.0\client-java-core-2.7.0.pom.sha1
[DEBUG] file client-java-core-2.7.0.pom.sha1 has a filtered file extension
[DEBUG] copy C:\underwriterTest\src\test\resources\repository\com\epam\reportportal\client-java-core\2.7.0\client-java-core-2.7.0.pom.sha1 to C:\underwriterTest\target\test-classes\repository\com\epam\reportportal\client-java-core\2.7.0\client-java-core-2.7.0.pom.sha1
[DEBUG] Copying file repository\com\epam\reportportal\client-java-core\2.7.0\_remote.repositories
[DEBUG] file _remote.repositories has a filtered file extension
[DEBUG] copy C:\underwriterTest\src\test\resources\repository\com\epam\reportportal\client-java-core\2.7.0\_remote.repositories to C:\underwriterTest\target\test-classes\repository\com\epam\reportportal\client-java-core\2.7.0\_remote.repositories
[DEBUG] Copying file repository\com\epam\reportportal\commons-codec-repacked\1.0.1\commons-codec-repacked-1.0.1.pom
[DEBUG] file commons-codec-repacked-1.0.1.pom has a filtered file extension
[DEBUG] copy C:\underwriterTest\src\test\resources\repository\com\epam\reportportal\commons-codec-repacked\1.0.1\commons-codec-repacked-1.0.1.pom to C:\underwriterTest\target\test-classes\repository\com\epam\reportportal\commons-codec-repacked\1.0.1\commons-codec-repacked-1.0.1.pom
[DEBUG] Copying file repository\com\epam\reportportal\commons-codec-repacked\1.0.1\commons-codec-repacked-1.0.1.pom.sha1
[DEBUG] file commons-codec-repacked-1.0.1.pom.sha1 has a filtered file extension
[DEBUG] copy C:\underwriterTest\src\test\resources\repository\com\epam\reportportal\commons-codec-repacked\1.0.1\commons-codec-repacked-1.0.1.pom.sha1 to C:\underwriterTest\target\test-classes\repository\com\epam\reportportal\commons-codec-repacked\1.0.1\commons-codec-repacked-1.0.1.pom.sha1
[DEBUG] Copying file repository\com\epam\reportportal\commons-codec-repacked\1.0.1\_remote.repositories
[DEBUG] file _remote.repositories has a filtered file extension
[DEBUG] copy C:\underwriterTest\src\test\resources\repository\com\epam\reportportal\commons-codec-repacked\1.0.1\_remote.repositories to C:\underwriterTest\target\test-classes\repository\com\epam\reportportal\commons-codec-repacked\1.0.1\_remote.repositories
[DEBUG] Copying file repository\com\epam\reportportal\commons-codec-repacked\1.0.2\commons-codec-repacked-1.0.2.jar.sha1
[DEBUG] file commons-codec-repacked-1.0.2.jar.sha1 has a filtered file extension
[DEBUG] copy C:\underwriterTest\src\test\resources\repository\com\epam\reportportal\commons-codec-repacked\1.0.2\commons-codec-repacked-1.0.2.jar.sha1 to C:\underwriterTest\target\test-classes\repository\com\epam\reportportal\commons-codec-repacked\1.0.2\commons-codec-repacked-1.0.2.jar.sha1
[DEBUG] Copying file repository\com\epam\reportportal\commons-codec-repacked\1.0.2\commons-codec-repacked-1.0.2.pom
[DEBUG] file commons-codec-repacked-1.0.2.pom has a filtered file extension
[DEBUG] copy C:\underwriterTest\src\test\resources\repository\com\epam\reportportal\commons-codec-repacked\1.0.2\commons-codec-repacked-1.0.2.pom to C:\underwriterTest\target\test-classes\repository\com\epam\reportportal\commons-codec-repacked\1.0.2\commons-codec-repacked-1.0.2.pom
[DEBUG] Copying file repository\com\epam\reportportal\commons-codec-repacked\1.0.2\commons-codec-repacked-1.0.2.pom.sha1
[DEBUG] file commons-codec-repacked-1.0.2.pom.sha1 has a filtered file extension
[DEBUG] copy C:\underwriterTest\src\test\resources\repository\com\epam\reportportal\commons-codec-repacked\1.0.2\commons-codec-repacked-1.0.2.pom.sha1 to C:\underwriterTest\target\test-classes\repository\com\epam\reportportal\commons-codec-repacked\1.0.2\commons-codec-repacked-1.0.2.pom.sha1
[DEBUG] Copying file repository\com\epam\reportportal\commons-codec-repacked\1.0.2\_remote.repositories
[DEBUG] file _remote.repositories has a filtered file extension
[DEBUG] copy C:\underwriterTest\src\test\resources\repository\com\epam\reportportal\commons-codec-repacked\1.0.2\_remote.repositories to C:\underwriterTest\target\test-classes\repository\com\epam\reportportal\commons-codec-repacked\1.0.2\_remote.repositories
[DEBUG] Copying file repository\com\epam\reportportal\commons-model\2.6.0\commons-model-2.6.0.jar.sha1
[DEBUG] file commons-model-2.6.0.jar.sha1 has a filtered file extension
[DEBUG] copy C:\underwriterTest\src\test\resources\repository\com\epam\reportportal\commons-model\2.6.0\commons-model-2.6.0.jar.sha1 to C:\underwriterTest\target\test-classes\repository\com\epam\reportportal\commons-model\2.6.0\commons-model-2.6.0.jar.sha1
[DEBUG] Copying file repository\com\epam\reportportal\commons-model\2.6.0\commons-model-2.6.0.pom
[DEBUG] file commons-model-2.6.0.pom has a filtered file extension
[DEBUG] copy C:\underwriterTest\src\test\resources\repository\com\epam\reportportal\commons-model\2.6.0\commons-model-2.6.0.pom to C:\underwriterTest\target\test-classes\repository\com\epam\reportportal\commons-model\2.6.0\commons-model-2.6.0.pom
[DEBUG] Copying file repository\com\epam\reportportal\commons-model\2.6.0\commons-model-2.6.0.pom.sha1
[DEBUG] file commons-model-2.6.0.pom.sha1 has a filtered file extension
[DEBUG] copy C:\underwriterTest\src\test\resources\repository\com\epam\reportportal\commons-model\2.6.0\commons-model-2.6.0.pom.sha1 to C:\underwriterTest\target\test-classes\repository\com\epam\reportportal\commons-model\2.6.0\commons-model-2.6.0.pom.sha1
[DEBUG] Copying file repository\com\epam\reportportal\commons-model\2.6.0\_remote.repositories
[DEBUG] file _remote.repositories has a filtered file extension
[DEBUG] copy C:\underwriterTest\src\test\resources\repository\com\epam\reportportal\commons-model\2.6.0\_remote.repositories to C:\underwriterTest\target\test-classes\repository\com\epam\reportportal\commons-model\2.6.0\_remote.repositories
[DEBUG] Copying file repository\com\epam\reportportal\httpclient-repacked\1.0.1\httpclient-repacked-1.0.1.pom
[DEBUG] file httpclient-repacked-1.0.1.pom has a filtered file extension
[DEBUG] copy C:\underwriterTest\src\test\resources\repository\com\epam\reportportal\httpclient-repacked\1.0.1\httpclient-repacked-1.0.1.pom to C:\underwriterTest\target\test-classes\repository\com\epam\reportportal\httpclient-repacked\1.0.1\httpclient-repacked-1.0.1.pom
[DEBUG] Copying file repository\com\epam\reportportal\httpclient-repacked\1.0.1\httpclient-repacked-1.0.1.pom.sha1
[DEBUG] file httpclient-repacked-1.0.1.pom.sha1 has a filtered file extension
[DEBUG] copy C:\underwriterTest\src\test\resources\repository\com\epam\reportportal\httpclient-repacked\1.0.1\httpclient-repacked-1.0.1.pom.sha1 to C:\underwriterTest\target\test-classes\repository\com\epam\reportportal\httpclient-repacked\1.0.1\httpclient-repacked-1.0.1.pom.sha1
[DEBUG] Copying file repository\com\epam\reportportal\httpclient-repacked\1.0.1\_remote.repositories
[DEBUG] file _remote.repositories has a filtered file extension
[DEBUG] copy C:\underwriterTest\src\test\resources\repository\com\epam\reportportal\httpclient-repacked\1.0.1\_remote.repositories to C:\underwriterTest\target\test-classes\repository\com\epam\reportportal\httpclient-repacked\1.0.1\_remote.repositories
[DEBUG] Copying file repository\com\epam\reportportal\httpclient-repacked\1.0.2\httpclient-repacked-1.0.2.jar.sha1
[DEBUG] file httpclient-repacked-1.0.2.jar.sha1 has a filtered file extension
[DEBUG] copy C:\underwriterTest\src\test\resources\repository\com\epam\reportportal\httpclient-repacked\1.0.2\httpclient-repacked-1.0.2.jar.sha1 to C:\underwriterTest\target\test-classes\repository\com\epam\reportportal\httpclient-repacked\1.0.2\httpclient-repacked-1.0.2.jar.sha1
[DEBUG] Copying file repository\com\epam\reportportal\httpclient-repacked\1.0.2\httpclient-repacked-1.0.2.pom
[DEBUG] file httpclient-repacked-1.0.2.pom has a filtered file extension
[DEBUG] copy C:\underwriterTest\src\test\resources\repository\com\epam\reportportal\httpclient-repacked\1.0.2\httpclient-repacked-1.0.2.pom to C:\underwriterTest\target\test-classes\repository\com\epam\reportportal\httpclient-repacked\1.0.2\httpclient-repacked-1.0.2.pom
[DEBUG] Copying file repository\com\epam\reportportal\httpclient-repacked\1.0.2\httpclient-repacked-1.0.2.pom.sha1
[DEBUG] file httpclient-repacked-1.0.2.pom.sha1 has a filtered file extension
[DEBUG] copy C:\underwriterTest\src\test\resources\repository\com\epam\reportportal\httpclient-repacked\1.0.2\httpclient-repacked-1.0.2.pom.sha1 to C:\underwriterTest\target\test-classes\repository\com\epam\reportportal\httpclient-repacked\1.0.2\httpclient-repacked-1.0.2.pom.sha1
[DEBUG] Copying file repository\com\epam\reportportal\httpclient-repacked\1.0.2\_remote.repositories
[DEBUG] file _remote.repositories has a filtered file extension
[DEBUG] copy C:\underwriterTest\src\test\resources\repository\com\epam\reportportal\httpclient-repacked\1.0.2\_remote.repositories to C:\underwriterTest\target\test-classes\repository\com\epam\reportportal\httpclient-repacked\1.0.2\_remote.repositories
[DEBUG] Copying file repository\com\epam\reportportal\logger-java-log4j\2.6.1\logger-java-log4j-2.6.1.jar.sha1
[DEBUG] file logger-java-log4j-2.6.1.jar.sha1 has a filtered file extension
[DEBUG] copy C:\underwriterTest\src\test\resources\repository\com\epam\reportportal\logger-java-log4j\2.6.1\logger-java-log4j-2.6.1.jar.sha1 to C:\underwriterTest\target\test-classes\repository\com\epam\reportportal\logger-java-log4j\2.6.1\logger-java-log4j-2.6.1.jar.sha1
[DEBUG] Copying file repository\com\epam\reportportal\logger-java-log4j\2.6.1\logger-java-log4j-2.6.1.pom
[DEBUG] file logger-java-log4j-2.6.1.pom has a filtered file extension
[DEBUG] copy C:\underwriterTest\src\test\resources\repository\com\epam\reportportal\logger-java-log4j\2.6.1\logger-java-log4j-2.6.1.pom to C:\underwriterTest\target\test-classes\repository\com\epam\reportportal\logger-java-log4j\2.6.1\logger-java-log4j-2.6.1.pom
[DEBUG] Copying file repository\com\epam\reportportal\logger-java-log4j\2.6.1\logger-java-log4j-2.6.1.pom.sha1
[DEBUG] file logger-java-log4j-2.6.1.pom.sha1 has a filtered file extension
[DEBUG] copy C:\underwriterTest\src\test\resources\repository\com\epam\reportportal\logger-java-log4j\2.6.1\logger-java-log4j-2.6.1.pom.sha1 to C:\underwriterTest\target\test-classes\repository\com\epam\reportportal\logger-java-log4j\2.6.1\logger-java-log4j-2.6.1.pom.sha1
[DEBUG] Copying file repository\com\epam\reportportal\logger-java-log4j\2.6.1\_remote.repositories
[DEBUG] file _remote.repositories has a filtered file extension
[DEBUG] copy C:\underwriterTest\src\test\resources\repository\com\epam\reportportal\logger-java-log4j\2.6.1\_remote.repositories to C:\underwriterTest\target\test-classes\repository\com\epam\reportportal\logger-java-log4j\2.6.1\_remote.repositories
[DEBUG] Copying file repository\com\epam\reportportal\logger-java-logback\2.6.0\logger-java-logback-2.6.0.jar.sha1
[DEBUG] file logger-java-logback-2.6.0.jar.sha1 has a filtered file extension
[DEBUG] copy C:\underwriterTest\src\test\resources\repository\com\epam\reportportal\logger-java-logback\2.6.0\logger-java-logback-2.6.0.jar.sha1 to C:\underwriterTest\target\test-classes\repository\com\epam\reportportal\logger-java-logback\2.6.0\logger-java-logback-2.6.0.jar.sha1
[DEBUG] Copying file repository\com\epam\reportportal\logger-java-logback\2.6.0\logger-java-logback-2.6.0.pom
[DEBUG] file logger-java-logback-2.6.0.pom has a filtered file extension
[DEBUG] copy C:\underwriterTest\src\test\resources\repository\com\epam\reportportal\logger-java-logback\2.6.0\logger-java-logback-2.6.0.pom to C:\underwriterTest\target\test-classes\repository\com\epam\reportportal\logger-java-logback\2.6.0\logger-java-logback-2.6.0.pom
[DEBUG] Copying file repository\com\epam\reportportal\logger-java-logback\2.6.0\logger-java-logback-2.6.0.pom.sha1
[DEBUG] file logger-java-logback-2.6.0.pom.sha1 has a filtered file extension
[DEBUG] copy C:\underwriterTest\src\test\resources\repository\com\epam\reportportal\logger-java-logback\2.6.0\logger-java-logback-2.6.0.pom.sha1 to C:\underwriterTest\target\test-classes\repository\com\epam\reportportal\logger-java-logback\2.6.0\logger-java-logback-2.6.0.pom.sha1
[DEBUG] Copying file repository\com\epam\reportportal\logger-java-logback\2.6.0\_remote.repositories
[DEBUG] file _remote.repositories has a filtered file extension
[DEBUG] copy C:\underwriterTest\src\test\resources\repository\com\epam\reportportal\logger-java-logback\2.6.0\_remote.repositories to C:\underwriterTest\target\test-classes\repository\com\epam\reportportal\logger-java-logback\2.6.0\_remote.repositories
[DEBUG] Copying file repository\com\epam\reportportal\rest-client-core\1.0.3\rest-client-core-1.0.3.pom
[DEBUG] file rest-client-core-1.0.3.pom has a filtered file extension
[DEBUG] copy C:\underwriterTest\src\test\resources\repository\com\epam\reportportal\rest-client-core\1.0.3\rest-client-core-1.0.3.pom to C:\underwriterTest\target\test-classes\repository\com\epam\reportportal\rest-client-core\1.0.3\rest-client-core-1.0.3.pom
[DEBUG] Copying file repository\com\epam\reportportal\rest-client-core\1.0.3\rest-client-core-1.0.3.pom.sha1
[DEBUG] file rest-client-core-1.0.3.pom.sha1 has a filtered file extension
[DEBUG] copy C:\underwriterTest\src\test\resources\repository\com\epam\reportportal\rest-client-core\1.0.3\rest-client-core-1.0.3.pom.sha1 to C:\underwriterTest\target\test-classes\repository\com\epam\reportportal\rest-client-core\1.0.3\rest-client-core-1.0.3.pom.sha1
[DEBUG] Copying file repository\com\epam\reportportal\rest-client-core\1.0.3\_remote.repositories
[DEBUG] file _remote.repositories has a filtered file extension
[DEBUG] copy C:\underwriterTest\src\test\resources\repository\com\epam\reportportal\rest-client-core\1.0.3\_remote.repositories to C:\underwriterTest\target\test-classes\repository\com\epam\reportportal\rest-client-core\1.0.3\_remote.repositories
[DEBUG] Copying file repository\com\epam\reportportal\rest-client-core\1.0.4\rest-client-core-1.0.4.jar.sha1
[DEBUG] file rest-client-core-1.0.4.jar.sha1 has a filtered file extension
[DEBUG] copy C:\underwriterTest\src\test\resources\repository\com\epam\reportportal\rest-client-core\1.0.4\rest-client-core-1.0.4.jar.sha1 to C:\underwriterTest\target\test-classes\repository\com\epam\reportportal\rest-client-core\1.0.4\rest-client-core-1.0.4.jar.sha1
[DEBUG] Copying file repository\com\epam\reportportal\rest-client-core\1.0.4\rest-client-core-1.0.4.pom
[DEBUG] file rest-client-core-1.0.4.pom has a filtered file extension
[DEBUG] copy C:\underwriterTest\src\test\resources\repository\com\epam\reportportal\rest-client-core\1.0.4\rest-client-core-1.0.4.pom to C:\underwriterTest\target\test-classes\repository\com\epam\reportportal\rest-client-core\1.0.4\rest-client-core-1.0.4.pom
[DEBUG] Copying file repository\com\epam\reportportal\rest-client-core\1.0.4\rest-client-core-1.0.4.pom.sha1
[DEBUG] file rest-client-core-1.0.4.pom.sha1 has a filtered file extension
[DEBUG] copy C:\underwriterTest\src\test\resources\repository\com\epam\reportportal\rest-client-core\1.0.4\rest-client-core-1.0.4.pom.sha1 to C:\underwriterTest\target\test-classes\repository\com\epam\reportportal\rest-client-core\1.0.4\rest-client-core-1.0.4.pom.sha1
[DEBUG] Copying file repository\com\epam\reportportal\rest-client-core\1.0.4\_remote.repositories
[DEBUG] file _remote.repositories has a filtered file extension
[DEBUG] copy C:\underwriterTest\src\test\resources\repository\com\epam\reportportal\rest-client-core\1.0.4\_remote.repositories to C:\underwriterTest\target\test-classes\repository\com\epam\reportportal\rest-client-core\1.0.4\_remote.repositories
[DEBUG] Copying file sendToUnd\sendToApp_2726.txt
[DEBUG] file sendToApp_2726.txt has a filtered file extension
[DEBUG] copy C:\underwriterTest\src\test\resources\sendToUnd\sendToApp_2726.txt to C:\underwriterTest\target\test-classes\sendToUnd\sendToApp_2726.txt
[DEBUG] Copying file sendToUnd\sendToApp_2727.txt
[DEBUG] file sendToApp_2727.txt has a filtered file extension
[DEBUG] copy C:\underwriterTest\src\test\resources\sendToUnd\sendToApp_2727.txt to C:\underwriterTest\target\test-classes\sendToUnd\sendToApp_2727.txt
[DEBUG] Copying file sendToUnd\sendToUnd_1312.txt
[DEBUG] file sendToUnd_1312.txt has a filtered file extension
[DEBUG] copy C:\underwriterTest\src\test\resources\sendToUnd\sendToUnd_1312.txt to C:\underwriterTest\target\test-classes\sendToUnd\sendToUnd_1312.txt
[DEBUG] Copying file sendToUnd\sendToUnd_1317.txt
[DEBUG] file sendToUnd_1317.txt has a filtered file extension
[DEBUG] copy C:\underwriterTest\src\test\resources\sendToUnd\sendToUnd_1317.txt to C:\underwriterTest\target\test-classes\sendToUnd\sendToUnd_1317.txt
[DEBUG] Copying file sendToUnd\sendToUnd_1322.txt
[DEBUG] file sendToUnd_1322.txt has a filtered file extension
[DEBUG] copy C:\underwriterTest\src\test\resources\sendToUnd\sendToUnd_1322.txt to C:\underwriterTest\target\test-classes\sendToUnd\sendToUnd_1322.txt
[DEBUG] Copying file sendToUnd\sendToUnd_1387.txt
[DEBUG] file sendToUnd_1387.txt has a filtered file extension
[DEBUG] copy C:\underwriterTest\src\test\resources\sendToUnd\sendToUnd_1387.txt to C:\underwriterTest\target\test-classes\sendToUnd\sendToUnd_1387.txt
[DEBUG] Copying file sendToUnd\sendToUnd_1392.txt
[DEBUG] file sendToUnd_1392.txt has a filtered file extension
[DEBUG] copy C:\underwriterTest\src\test\resources\sendToUnd\sendToUnd_1392.txt to C:\underwriterTest\target\test-classes\sendToUnd\sendToUnd_1392.txt
[DEBUG] Copying file sendToUnd\sendToUnd_1397.txt
[DEBUG] file sendToUnd_1397.txt has a filtered file extension
[DEBUG] copy C:\underwriterTest\src\test\resources\sendToUnd\sendToUnd_1397.txt to C:\underwriterTest\target\test-classes\sendToUnd\sendToUnd_1397.txt
[DEBUG] Copying file sendToUnd\sendToUnd_1398.txt
[DEBUG] file sendToUnd_1398.txt has a filtered file extension
[DEBUG] copy C:\underwriterTest\src\test\resources\sendToUnd\sendToUnd_1398.txt to C:\underwriterTest\target\test-classes\sendToUnd\sendToUnd_1398.txt
[DEBUG] Copying file sendToUnd\sendToUnd_1402.txt
[DEBUG] file sendToUnd_1402.txt has a filtered file extension
[DEBUG] copy C:\underwriterTest\src\test\resources\sendToUnd\sendToUnd_1402.txt to C:\underwriterTest\target\test-classes\sendToUnd\sendToUnd_1402.txt
[DEBUG] Copying file sendToUnd\sendToUnd_1495.txt
[DEBUG] file sendToUnd_1495.txt has a filtered file extension
[DEBUG] copy C:\underwriterTest\src\test\resources\sendToUnd\sendToUnd_1495.txt to C:\underwriterTest\target\test-classes\sendToUnd\sendToUnd_1495.txt
[DEBUG] Copying file sendToUnd\sendToUnd_1496.txt
[DEBUG] file sendToUnd_1496.txt has a filtered file extension
[DEBUG] copy C:\underwriterTest\src\test\resources\sendToUnd\sendToUnd_1496.txt to C:\underwriterTest\target\test-classes\sendToUnd\sendToUnd_1496.txt
[DEBUG] Copying file sendToUnd\sendToUnd_1514.txt
[DEBUG] file sendToUnd_1514.txt has a filtered file extension
[DEBUG] copy C:\underwriterTest\src\test\resources\sendToUnd\sendToUnd_1514.txt to C:\underwriterTest\target\test-classes\sendToUnd\sendToUnd_1514.txt
[DEBUG] Copying file sendToUnd\sendToUnd_1523.txt
[DEBUG] file sendToUnd_1523.txt has a filtered file extension
[DEBUG] copy C:\underwriterTest\src\test\resources\sendToUnd\sendToUnd_1523.txt to C:\underwriterTest\target\test-classes\sendToUnd\sendToUnd_1523.txt
[DEBUG] Copying file sendToUnd\sendToUnd_1528.txt
[DEBUG] file sendToUnd_1528.txt has a filtered file extension
[DEBUG] copy C:\underwriterTest\src\test\resources\sendToUnd\sendToUnd_1528.txt to C:\underwriterTest\target\test-classes\sendToUnd\sendToUnd_1528.txt
[DEBUG] Copying file sendToUnd\sendToUnd_1558.txt
[DEBUG] file sendToUnd_1558.txt has a filtered file extension
[DEBUG] copy C:\underwriterTest\src\test\resources\sendToUnd\sendToUnd_1558.txt to C:\underwriterTest\target\test-classes\sendToUnd\sendToUnd_1558.txt
[DEBUG] Copying file sendToUnd\sendToUnd_1563.txt
[DEBUG] file sendToUnd_1563.txt has a filtered file extension
[DEBUG] copy C:\underwriterTest\src\test\resources\sendToUnd\sendToUnd_1563.txt to C:\underwriterTest\target\test-classes\sendToUnd\sendToUnd_1563.txt
[DEBUG] Copying file sendToUnd\sendToUnd_1583.txt
[DEBUG] file sendToUnd_1583.txt has a filtered file extension
[DEBUG] copy C:\underwriterTest\src\test\resources\sendToUnd\sendToUnd_1583.txt to C:\underwriterTest\target\test-classes\sendToUnd\sendToUnd_1583.txt
[DEBUG] Copying file sendToUnd\sendToUnd_1585.txt
[DEBUG] file sendToUnd_1585.txt has a filtered file extension
[DEBUG] copy C:\underwriterTest\src\test\resources\sendToUnd\sendToUnd_1585.txt to C:\underwriterTest\target\test-classes\sendToUnd\sendToUnd_1585.txt
[DEBUG] Copying file sendToUnd\sendToUnd_1615.txt
[DEBUG] file sendToUnd_1615.txt has a filtered file extension
[DEBUG] copy C:\underwriterTest\src\test\resources\sendToUnd\sendToUnd_1615.txt to C:\underwriterTest\target\test-classes\sendToUnd\sendToUnd_1615.txt
[DEBUG] Copying file sendToUnd\sendToUnd_1711.txt
[DEBUG] file sendToUnd_1711.txt has a filtered file extension
[DEBUG] copy C:\underwriterTest\src\test\resources\sendToUnd\sendToUnd_1711.txt to C:\underwriterTest\target\test-classes\sendToUnd\sendToUnd_1711.txt
[DEBUG] Copying file sendToUnd\sendToUnd_1713.txt
[DEBUG] file sendToUnd_1713.txt has a filtered file extension
[DEBUG] copy C:\underwriterTest\src\test\resources\sendToUnd\sendToUnd_1713.txt to C:\underwriterTest\target\test-classes\sendToUnd\sendToUnd_1713.txt
[DEBUG] Copying file sendToUnd\sendToUnd_1804.txt
[DEBUG] file sendToUnd_1804.txt has a filtered file extension
[DEBUG] copy C:\underwriterTest\src\test\resources\sendToUnd\sendToUnd_1804.txt to C:\underwriterTest\target\test-classes\sendToUnd\sendToUnd_1804.txt
[DEBUG] Copying file sendToUnd\sendToUnd_1807.txt
[DEBUG] file sendToUnd_1807.txt has a filtered file extension
[DEBUG] copy C:\underwriterTest\src\test\resources\sendToUnd\sendToUnd_1807.txt to C:\underwriterTest\target\test-classes\sendToUnd\sendToUnd_1807.txt
[DEBUG] Copying file sendToUnd\sendToUnd_1808.txt
[DEBUG] file sendToUnd_1808.txt has a filtered file extension
[DEBUG] copy C:\underwriterTest\src\test\resources\sendToUnd\sendToUnd_1808.txt to C:\underwriterTest\target\test-classes\sendToUnd\sendToUnd_1808.txt
[DEBUG] Copying file sendToUnd\sendToUnd_1810.txt
[DEBUG] file sendToUnd_1810.txt has a filtered file extension
[DEBUG] copy C:\underwriterTest\src\test\resources\sendToUnd\sendToUnd_1810.txt to C:\underwriterTest\target\test-classes\sendToUnd\sendToUnd_1810.txt
[DEBUG] Copying file sendToUnd\sendToUnd_1811.txt
[DEBUG] file sendToUnd_1811.txt has a filtered file extension
[DEBUG] copy C:\underwriterTest\src\test\resources\sendToUnd\sendToUnd_1811.txt to C:\underwriterTest\target\test-classes\sendToUnd\sendToUnd_1811.txt
[DEBUG] Copying file sendToUnd\sendToUnd_1812.txt
[DEBUG] file sendToUnd_1812.txt has a filtered file extension
[DEBUG] copy C:\underwriterTest\src\test\resources\sendToUnd\sendToUnd_1812.txt to C:\underwriterTest\target\test-classes\sendToUnd\sendToUnd_1812.txt
[DEBUG] Copying file sendToUnd\sendToUnd_1813.txt
[DEBUG] file sendToUnd_1813.txt has a filtered file extension
[DEBUG] copy C:\underwriterTest\src\test\resources\sendToUnd\sendToUnd_1813.txt to C:\underwriterTest\target\test-classes\sendToUnd\sendToUnd_1813.txt
[DEBUG] Copying file sendToUnd\sendToUnd_1814.txt
[DEBUG] file sendToUnd_1814.txt has a filtered file extension
[DEBUG] copy C:\underwriterTest\src\test\resources\sendToUnd\sendToUnd_1814.txt to C:\underwriterTest\target\test-classes\sendToUnd\sendToUnd_1814.txt
[DEBUG] Copying file sendToUnd\sendToUnd_1815.txt
[DEBUG] file sendToUnd_1815.txt has a filtered file extension
[DEBUG] copy C:\underwriterTest\src\test\resources\sendToUnd\sendToUnd_1815.txt to C:\underwriterTest\target\test-classes\sendToUnd\sendToUnd_1815.txt
[DEBUG] Copying file sendToUnd\sendToUnd_1817.txt
[DEBUG] file sendToUnd_1817.txt has a filtered file extension
[DEBUG] copy C:\underwriterTest\src\test\resources\sendToUnd\sendToUnd_1817.txt to C:\underwriterTest\target\test-classes\sendToUnd\sendToUnd_1817.txt
[DEBUG] Copying file sendToUnd\sendToUnd_1819.txt
[DEBUG] file sendToUnd_1819.txt has a filtered file extension
[DEBUG] copy C:\underwriterTest\src\test\resources\sendToUnd\sendToUnd_1819.txt to C:\underwriterTest\target\test-classes\sendToUnd\sendToUnd_1819.txt
[DEBUG] Copying file sendToUnd\sendToUnd_1821.txt
[DEBUG] file sendToUnd_1821.txt has a filtered file extension
[DEBUG] copy C:\underwriterTest\src\test\resources\sendToUnd\sendToUnd_1821.txt to C:\underwriterTest\target\test-classes\sendToUnd\sendToUnd_1821.txt
[DEBUG] Copying file sendToUnd\sendToUnd_1823.txt
[DEBUG] file sendToUnd_1823.txt has a filtered file extension
[DEBUG] copy C:\underwriterTest\src\test\resources\sendToUnd\sendToUnd_1823.txt to C:\underwriterTest\target\test-classes\sendToUnd\sendToUnd_1823.txt
[DEBUG] Copying file sendToUnd\sendToUnd_1824.txt
[DEBUG] file sendToUnd_1824.txt has a filtered file extension
[DEBUG] copy C:\underwriterTest\src\test\resources\sendToUnd\sendToUnd_1824.txt to C:\underwriterTest\target\test-classes\sendToUnd\sendToUnd_1824.txt
[DEBUG] Copying file sendToUnd\sendToUnd_1825.txt
[DEBUG] file sendToUnd_1825.txt has a filtered file extension
[DEBUG] copy C:\underwriterTest\src\test\resources\sendToUnd\sendToUnd_1825.txt to C:\underwriterTest\target\test-classes\sendToUnd\sendToUnd_1825.txt
[DEBUG] Copying file sendToUnd\sendToUnd_1826.txt
[DEBUG] file sendToUnd_1826.txt has a filtered file extension
[DEBUG] copy C:\underwriterTest\src\test\resources\sendToUnd\sendToUnd_1826.txt to C:\underwriterTest\target\test-classes\sendToUnd\sendToUnd_1826.txt
[DEBUG] Copying file sendToUnd\sendToUnd_1828.txt
[DEBUG] file sendToUnd_1828.txt has a filtered file extension
[DEBUG] copy C:\underwriterTest\src\test\resources\sendToUnd\sendToUnd_1828.txt to C:\underwriterTest\target\test-classes\sendToUnd\sendToUnd_1828.txt
[DEBUG] Copying file sendToUnd\sendToUnd_1830.txt
[DEBUG] file sendToUnd_1830.txt has a filtered file extension
[DEBUG] copy C:\underwriterTest\src\test\resources\sendToUnd\sendToUnd_1830.txt to C:\underwriterTest\target\test-classes\sendToUnd\sendToUnd_1830.txt
[DEBUG] Copying file sendToUnd\sendToUnd_1879.txt
[DEBUG] file sendToUnd_1879.txt has a filtered file extension
[DEBUG] copy C:\underwriterTest\src\test\resources\sendToUnd\sendToUnd_1879.txt to C:\underwriterTest\target\test-classes\sendToUnd\sendToUnd_1879.txt
[DEBUG] Copying file sendToUnd\sendToUnd_1891.txt
[DEBUG] file sendToUnd_1891.txt has a filtered file extension
[DEBUG] copy C:\underwriterTest\src\test\resources\sendToUnd\sendToUnd_1891.txt to C:\underwriterTest\target\test-classes\sendToUnd\sendToUnd_1891.txt
[DEBUG] Copying file sendToUnd\sendToUnd_1892.txt
[DEBUG] file sendToUnd_1892.txt has a filtered file extension
[DEBUG] copy C:\underwriterTest\src\test\resources\sendToUnd\sendToUnd_1892.txt to C:\underwriterTest\target\test-classes\sendToUnd\sendToUnd_1892.txt
[DEBUG] Copying file sendToUnd\sendToUnd_2052.txt
[DEBUG] file sendToUnd_2052.txt has a filtered file extension
[DEBUG] copy C:\underwriterTest\src\test\resources\sendToUnd\sendToUnd_2052.txt to C:\underwriterTest\target\test-classes\sendToUnd\sendToUnd_2052.txt
[DEBUG] Copying file sendToUnd\sendToUnd_2196.txt
[DEBUG] file sendToUnd_2196.txt has a filtered file extension
[DEBUG] copy C:\underwriterTest\src\test\resources\sendToUnd\sendToUnd_2196.txt to C:\underwriterTest\target\test-classes\sendToUnd\sendToUnd_2196.txt
[DEBUG] Copying file sendToUnd\sendToUnd_2255_1.txt
[DEBUG] file sendToUnd_2255_1.txt has a filtered file extension
[DEBUG] copy C:\underwriterTest\src\test\resources\sendToUnd\sendToUnd_2255_1.txt to C:\underwriterTest\target\test-classes\sendToUnd\sendToUnd_2255_1.txt
[DEBUG] Copying file sendToUnd\sendToUnd_2255_2.txt
[DEBUG] file sendToUnd_2255_2.txt has a filtered file extension
[DEBUG] copy C:\underwriterTest\src\test\resources\sendToUnd\sendToUnd_2255_2.txt to C:\underwriterTest\target\test-classes\sendToUnd\sendToUnd_2255_2.txt
[DEBUG] Copying file sendToUnd\sendToUnd_4289.txt
[DEBUG] file sendToUnd_4289.txt has a filtered file extension
[DEBUG] copy C:\underwriterTest\src\test\resources\sendToUnd\sendToUnd_4289.txt to C:\underwriterTest\target\test-classes\sendToUnd\sendToUnd_4289.txt
[DEBUG] Copying file sendToUnd\sendToUnd_4444.txt
[DEBUG] file sendToUnd_4444.txt has a filtered file extension
[DEBUG] copy C:\underwriterTest\src\test\resources\sendToUnd\sendToUnd_4444.txt to C:\underwriterTest\target\test-classes\sendToUnd\sendToUnd_4444.txt
[DEBUG] Copying file sendToUnd\sendToUnd_4528_1.txt
[DEBUG] file sendToUnd_4528_1.txt has a filtered file extension
[DEBUG] copy C:\underwriterTest\src\test\resources\sendToUnd\sendToUnd_4528_1.txt to C:\underwriterTest\target\test-classes\sendToUnd\sendToUnd_4528_1.txt
[DEBUG] Copying file sendToUnd\sendToUnd_4528_10.txt
[DEBUG] file sendToUnd_4528_10.txt has a filtered file extension
[DEBUG] copy C:\underwriterTest\src\test\resources\sendToUnd\sendToUnd_4528_10.txt to C:\underwriterTest\target\test-classes\sendToUnd\sendToUnd_4528_10.txt
[DEBUG] Copying file sendToUnd\sendToUnd_4528_2.txt
[DEBUG] file sendToUnd_4528_2.txt has a filtered file extension
[DEBUG] copy C:\underwriterTest\src\test\resources\sendToUnd\sendToUnd_4528_2.txt to C:\underwriterTest\target\test-classes\sendToUnd\sendToUnd_4528_2.txt
[DEBUG] Copying file sendToUnd\sendToUnd_4528_3.txt
[DEBUG] file sendToUnd_4528_3.txt has a filtered file extension
[DEBUG] copy C:\underwriterTest\src\test\resources\sendToUnd\sendToUnd_4528_3.txt to C:\underwriterTest\target\test-classes\sendToUnd\sendToUnd_4528_3.txt
[DEBUG] Copying file sendToUnd\sendToUnd_4528_4.txt
[DEBUG] file sendToUnd_4528_4.txt has a filtered file extension
[DEBUG] copy C:\underwriterTest\src\test\resources\sendToUnd\sendToUnd_4528_4.txt to C:\underwriterTest\target\test-classes\sendToUnd\sendToUnd_4528_4.txt
[DEBUG] Copying file sendToUnd\sendToUnd_4528_5.txt
[DEBUG] file sendToUnd_4528_5.txt has a filtered file extension
[DEBUG] copy C:\underwriterTest\src\test\resources\sendToUnd\sendToUnd_4528_5.txt to C:\underwriterTest\target\test-classes\sendToUnd\sendToUnd_4528_5.txt
[DEBUG] Copying file sendToUnd\sendToUnd_4528_6.txt
[DEBUG] file sendToUnd_4528_6.txt has a filtered file extension
[DEBUG] copy C:\underwriterTest\src\test\resources\sendToUnd\sendToUnd_4528_6.txt to C:\underwriterTest\target\test-classes\sendToUnd\sendToUnd_4528_6.txt
[DEBUG] Copying file sendToUnd\sendToUnd_4528_7.txt
[DEBUG] file sendToUnd_4528_7.txt has a filtered file extension
[DEBUG] copy C:\underwriterTest\src\test\resources\sendToUnd\sendToUnd_4528_7.txt to C:\underwriterTest\target\test-classes\sendToUnd\sendToUnd_4528_7.txt
[DEBUG] Copying file sendToUnd\sendToUnd_4528_8.txt
[DEBUG] file sendToUnd_4528_8.txt has a filtered file extension
[DEBUG] copy C:\underwriterTest\src\test\resources\sendToUnd\sendToUnd_4528_8.txt to C:\underwriterTest\target\test-classes\sendToUnd\sendToUnd_4528_8.txt
[DEBUG] Copying file sendToUnd\sendToUnd_4528_9.txt
[DEBUG] file sendToUnd_4528_9.txt has a filtered file extension
[DEBUG] copy C:\underwriterTest\src\test\resources\sendToUnd\sendToUnd_4528_9.txt to C:\underwriterTest\target\test-classes\sendToUnd\sendToUnd_4528_9.txt
[DEBUG] Copying file sendToUnd\sendToUnd_4537.txt
[DEBUG] file sendToUnd_4537.txt has a filtered file extension
[DEBUG] copy C:\underwriterTest\src\test\resources\sendToUnd\sendToUnd_4537.txt to C:\underwriterTest\target\test-classes\sendToUnd\sendToUnd_4537.txt
[DEBUG] Copying file sendToUnd\sendToUnd_4539.txt
[DEBUG] file sendToUnd_4539.txt has a filtered file extension
[DEBUG] copy C:\underwriterTest\src\test\resources\sendToUnd\sendToUnd_4539.txt to C:\underwriterTest\target\test-classes\sendToUnd\sendToUnd_4539.txt
[DEBUG] Copying file sendToUnd\sendToUnd_4541_1.txt
[DEBUG] file sendToUnd_4541_1.txt has a filtered file extension
[DEBUG] copy C:\underwriterTest\src\test\resources\sendToUnd\sendToUnd_4541_1.txt to C:\underwriterTest\target\test-classes\sendToUnd\sendToUnd_4541_1.txt
[DEBUG] Copying file sendToUnd\sendToUnd_4541_10.txt
[DEBUG] file sendToUnd_4541_10.txt has a filtered file extension
[DEBUG] copy C:\underwriterTest\src\test\resources\sendToUnd\sendToUnd_4541_10.txt to C:\underwriterTest\target\test-classes\sendToUnd\sendToUnd_4541_10.txt
[DEBUG] Copying file sendToUnd\sendToUnd_4541_2.txt
[DEBUG] file sendToUnd_4541_2.txt has a filtered file extension
[DEBUG] copy C:\underwriterTest\src\test\resources\sendToUnd\sendToUnd_4541_2.txt to C:\underwriterTest\target\test-classes\sendToUnd\sendToUnd_4541_2.txt
[DEBUG] Copying file sendToUnd\sendToUnd_4541_3.txt
[DEBUG] file sendToUnd_4541_3.txt has a filtered file extension
[DEBUG] copy C:\underwriterTest\src\test\resources\sendToUnd\sendToUnd_4541_3.txt to C:\underwriterTest\target\test-classes\sendToUnd\sendToUnd_4541_3.txt
[DEBUG] Copying file sendToUnd\sendToUnd_4541_4.txt
[DEBUG] file sendToUnd_4541_4.txt has a filtered file extension
[DEBUG] copy C:\underwriterTest\src\test\resources\sendToUnd\sendToUnd_4541_4.txt to C:\underwriterTest\target\test-classes\sendToUnd\sendToUnd_4541_4.txt
[DEBUG] Copying file sendToUnd\sendToUnd_4541_5.txt
[DEBUG] file sendToUnd_4541_5.txt has a filtered file extension
[DEBUG] copy C:\underwriterTest\src\test\resources\sendToUnd\sendToUnd_4541_5.txt to C:\underwriterTest\target\test-classes\sendToUnd\sendToUnd_4541_5.txt
[DEBUG] Copying file sendToUnd\sendToUnd_4541_6.txt
[DEBUG] file sendToUnd_4541_6.txt has a filtered file extension
[DEBUG] copy C:\underwriterTest\src\test\resources\sendToUnd\sendToUnd_4541_6.txt to C:\underwriterTest\target\test-classes\sendToUnd\sendToUnd_4541_6.txt
[DEBUG] Copying file sendToUnd\sendToUnd_4541_7.txt
[DEBUG] file sendToUnd_4541_7.txt has a filtered file extension
[DEBUG] copy C:\underwriterTest\src\test\resources\sendToUnd\sendToUnd_4541_7.txt to C:\underwriterTest\target\test-classes\sendToUnd\sendToUnd_4541_7.txt
[DEBUG] Copying file sendToUnd\sendToUnd_4541_8.txt
[DEBUG] file sendToUnd_4541_8.txt has a filtered file extension
[DEBUG] copy C:\underwriterTest\src\test\resources\sendToUnd\sendToUnd_4541_8.txt to C:\underwriterTest\target\test-classes\sendToUnd\sendToUnd_4541_8.txt
[DEBUG] Copying file sendToUnd\sendToUnd_4541_9.txt
[DEBUG] file sendToUnd_4541_9.txt has a filtered file extension
[DEBUG] copy C:\underwriterTest\src\test\resources\sendToUnd\sendToUnd_4541_9.txt to C:\underwriterTest\target\test-classes\sendToUnd\sendToUnd_4541_9.txt
[DEBUG] Copying file sendToUnd\sendToUnd_4542.txt
[DEBUG] file sendToUnd_4542.txt has a filtered file extension
[DEBUG] copy C:\underwriterTest\src\test\resources\sendToUnd\sendToUnd_4542.txt to C:\underwriterTest\target\test-classes\sendToUnd\sendToUnd_4542.txt
[DEBUG] Copying file sendToUnd\sendToUnd_4543.txt
[DEBUG] file sendToUnd_4543.txt has a filtered file extension
[DEBUG] copy C:\underwriterTest\src\test\resources\sendToUnd\sendToUnd_4543.txt to C:\underwriterTest\target\test-classes\sendToUnd\sendToUnd_4543.txt
[DEBUG] Copying file sendToUnd\sendToUnd_4545.txt
[DEBUG] file sendToUnd_4545.txt has a filtered file extension
[DEBUG] copy C:\underwriterTest\src\test\resources\sendToUnd\sendToUnd_4545.txt to C:\underwriterTest\target\test-classes\sendToUnd\sendToUnd_4545.txt
[DEBUG] Copying file sendToUnd\sendToUnd_4749_1.txt
[DEBUG] file sendToUnd_4749_1.txt has a filtered file extension
[DEBUG] copy C:\underwriterTest\src\test\resources\sendToUnd\sendToUnd_4749_1.txt to C:\underwriterTest\target\test-classes\sendToUnd\sendToUnd_4749_1.txt
[DEBUG] Copying file sendToUnd\sendToUnd_4749_2.txt
[DEBUG] file sendToUnd_4749_2.txt has a filtered file extension
[DEBUG] copy C:\underwriterTest\src\test\resources\sendToUnd\sendToUnd_4749_2.txt to C:\underwriterTest\target\test-classes\sendToUnd\sendToUnd_4749_2.txt
[DEBUG] Copying file sendToUnd\sendToUnd_4749_3.txt
[DEBUG] file sendToUnd_4749_3.txt has a filtered file extension
[DEBUG] copy C:\underwriterTest\src\test\resources\sendToUnd\sendToUnd_4749_3.txt to C:\underwriterTest\target\test-classes\sendToUnd\sendToUnd_4749_3.txt
[DEBUG] Copying file sendToUnd\sendToUnd_npd_5194_1.txt
[DEBUG] file sendToUnd_npd_5194_1.txt has a filtered file extension
[DEBUG] copy C:\underwriterTest\src\test\resources\sendToUnd\sendToUnd_npd_5194_1.txt to C:\underwriterTest\target\test-classes\sendToUnd\sendToUnd_npd_5194_1.txt
[DEBUG] Copying file sendToUnd\sendToUnd_npd_5194_2.txt
[DEBUG] file sendToUnd_npd_5194_2.txt has a filtered file extension
[DEBUG] copy C:\underwriterTest\src\test\resources\sendToUnd\sendToUnd_npd_5194_2.txt to C:\underwriterTest\target\test-classes\sendToUnd\sendToUnd_npd_5194_2.txt
[DEBUG] Copying file sendToUnd\sendToUnd_npd_5194_3.txt
[DEBUG] file sendToUnd_npd_5194_3.txt has a filtered file extension
[DEBUG] copy C:\underwriterTest\src\test\resources\sendToUnd\sendToUnd_npd_5194_3.txt to C:\underwriterTest\target\test-classes\sendToUnd\sendToUnd_npd_5194_3.txt
[DEBUG] Copying file sendToUnd\sendToUnd_npd_5194_4.txt
[DEBUG] file sendToUnd_npd_5194_4.txt has a filtered file extension
[DEBUG] copy C:\underwriterTest\src\test\resources\sendToUnd\sendToUnd_npd_5194_4.txt to C:\underwriterTest\target\test-classes\sendToUnd\sendToUnd_npd_5194_4.txt
[DEBUG] Copying file sendToUnd_1824.txt
[DEBUG] file sendToUnd_1824.txt has a filtered file extension
[DEBUG] copy C:\underwriterTest\src\test\resources\sendToUnd_1824.txt to C:\underwriterTest\target\test-classes\sendToUnd_1824.txt
[DEBUG] Copying file sendToUnd_2052.txt
[DEBUG] file sendToUnd_2052.txt has a filtered file extension
[DEBUG] copy C:\underwriterTest\src\test\resources\sendToUnd_2052.txt to C:\underwriterTest\target\test-classes\sendToUnd_2052.txt
[DEBUG] no use filter components
[INFO] 
[INFO] --- maven-compiler-plugin:3.7.0:testCompile (default-testCompile) @ UFOTests ---
[DEBUG] Configuring mojo org.apache.maven.plugins:maven-compiler-plugin:3.7.0:testCompile from plugin realm ClassRealm[plugin>org.apache.maven.plugins:maven-compiler-plugin:3.7.0, parent: sun.misc.Launcher$AppClassLoader@55f96302]
[DEBUG] Configuring mojo 'org.apache.maven.plugins:maven-compiler-plugin:3.7.0:testCompile' with basic configurator -->
[DEBUG]   (f) basedir = C:\underwriterTest
[DEBUG]   (f) buildDirectory = C:\underwriterTest\target
[DEBUG]   (f) compilePath = [C:\underwriterTest\target\classes, C:\Users\ufo_bamboo_agent\.m2\repository\org\slf4j\slf4j-api\1.7.25\slf4j-api-1.7.25.jar, C:\Users\ufo_bamboo_agent\.m2\repository\org\slf4j\slf4j-log4j12\1.7.25\slf4j-log4j12-1.7.25.jar, C:\Users\ufo_bamboo_agent\.m2\repository\com\codeborne\selenide\4.8\selenide-4.8.jar, C:\Users\ufo_bamboo_agent\.m2\repository\io\github\bonigarcia\webdrivermanager\1.7.2\webdrivermanager-1.7.2.jar, C:\Users\ufo_bamboo_agent\.m2\repository\com\typesafe\config\1.2.1\config-1.2.1.jar, C:\Users\ufo_bamboo_agent\.m2\repository\org\apache\commons\commons-lang3\3.5\commons-lang3-3.5.jar, C:\Users\ufo_bamboo_agent\.m2\repository\org\rauschig\jarchivelib\0.7.1\jarchivelib-0.7.1.jar, C:\Users\ufo_bamboo_agent\.m2\repository\org\apache\commons\commons-compress\1.9\commons-compress-1.9.jar, C:\Users\ufo_bamboo_agent\.m2\repository\org\jsoup\jsoup\1.10.2\jsoup-1.10.2.jar, C:\Users\ufo_bamboo_agent\.m2\repository\org\apache\httpcomponents\httpcore\4.4.7\httpcore-4.4.7.jar, C:\Users\ufo_bamboo_agent\.m2\repository\org\seleniumhq\selenium\selenium-java\3.6.0\selenium-java-3.6.0.jar, C:\Users\ufo_bamboo_agent\.m2\repository\org\seleniumhq\selenium\selenium-chrome-driver\3.6.0\selenium-chrome-driver-3.6.0.jar, C:\Users\ufo_bamboo_agent\.m2\repository\org\seleniumhq\selenium\selenium-edge-driver\3.6.0\selenium-edge-driver-3.6.0.jar, C:\Users\ufo_bamboo_agent\.m2\repository\org\seleniumhq\selenium\selenium-firefox-driver\3.6.0\selenium-firefox-driver-3.6.0.jar, C:\Users\ufo_bamboo_agent\.m2\repository\org\seleniumhq\selenium\selenium-ie-driver\3.6.0\selenium-ie-driver-3.6.0.jar, C:\Users\ufo_bamboo_agent\.m2\repository\org\seleniumhq\selenium\selenium-opera-driver\3.6.0\selenium-opera-driver-3.6.0.jar, C:\Users\ufo_bamboo_agent\.m2\repository\com\google\code\gson\gson\2.8.2\gson-2.8.2.jar, C:\Users\ufo_bamboo_agent\.m2\repository\com\google\guava\guava\23.0\guava-23.0.jar, C:\Users\ufo_bamboo_agent\.m2\repository\com\google\code\findbugs\jsr305\1.3.9\jsr305-1.3.9.jar, C:\Users\ufo_bamboo_agent\.m2\repository\com\google\errorprone\error_prone_annotations\2.0.18\error_prone_annotations-2.0.18.jar, C:\Users\ufo_bamboo_agent\.m2\repository\com\google\j2objc\j2objc-annotations\1.1\j2objc-annotations-1.1.jar, C:\Users\ufo_bamboo_agent\.m2\repository\org\codehaus\mojo\animal-sniffer-annotations\1.14\animal-sniffer-annotations-1.14.jar, C:\Users\ufo_bamboo_agent\.m2\repository\net\lightbody\bmp\browsermob-core\2.1.5\browsermob-core-2.1.5.jar, C:\Users\ufo_bamboo_agent\.m2\repository\net\lightbody\bmp\littleproxy\1.1.0-beta-bmp-17\littleproxy-1.1.0-beta-bmp-17.jar, C:\Users\ufo_bamboo_agent\.m2\repository\com\fasterxml\jackson\core\jackson-core\2.8.9\jackson-core-2.8.9.jar, C:\Users\ufo_bamboo_agent\.m2\repository\com\fasterxml\jackson\core\jackson-databind\2.8.9\jackson-databind-2.8.9.jar, C:\Users\ufo_bamboo_agent\.m2\repository\com\fasterxml\jackson\core\jackson-annotations\2.8.9\jackson-annotations-2.8.9.jar, C:\Users\ufo_bamboo_agent\.m2\repository\dnsjava\dnsjava\2.1.8\dnsjava-2.1.8.jar, C:\Users\ufo_bamboo_agent\.m2\repository\org\slf4j\jcl-over-slf4j\1.7.25\jcl-over-slf4j-1.7.25.jar, C:\Users\ufo_bamboo_agent\.m2\repository\com\jcraft\jzlib\1.1.3\jzlib-1.1.3.jar, C:\Users\ufo_bamboo_agent\.m2\repository\io\netty\netty-all\4.0.51.Final\netty-all-4.0.51.Final.jar, C:\Users\ufo_bamboo_agent\.m2\repository\org\bouncycastle\bcprov-jdk15on\1.58\bcprov-jdk15on-1.58.jar, C:\Users\ufo_bamboo_agent\.m2\repository\org\bouncycastle\bcpkix-jdk15on\1.58\bcpkix-jdk15on-1.58.jar, C:\Users\ufo_bamboo_agent\.m2\repository\net\lightbody\bmp\mitm\2.1.5\mitm-2.1.5.jar, C:\Users\ufo_bamboo_agent\.m2\repository\commons-codec\commons-codec\1.10\commons-codec-1.10.jar, C:\Users\ufo_bamboo_agent\.m2\repository\org\seleniumhq\selenium\selenium-support\3.6.0\selenium-support-3.6.0.jar, C:\Users\ufo_bamboo_agent\.m2\repository\org\seleniumhq\selenium\selenium-api\3.6.0\selenium-api-3.6.0.jar, C:\Users\ufo_bamboo_agent\.m2\repository\org\seleniumhq\selenium\selenium-remote-driver\3.6.0\selenium-remote-driver-3.6.0.jar, C:\Users\ufo_bamboo_agent\.m2\repository\net\bytebuddy\byte-buddy\1.7.5\byte-buddy-1.7.5.jar, C:\Users\ufo_bamboo_agent\.m2\repository\org\apache\commons\commons-exec\1.3\commons-exec-1.3.jar, C:\Users\ufo_bamboo_agent\.m2\repository\commons-logging\commons-logging\1.2\commons-logging-1.2.jar, C:\Users\ufo_bamboo_agent\.m2\repository\org\apache\httpcomponents\httpclient\4.5.3\httpclient-4.5.3.jar, C:\Users\ufo_bamboo_agent\.m2\repository\net\java\dev\jna\jna\4.1.0\jna-4.1.0.jar, C:\Users\ufo_bamboo_agent\.m2\repository\net\java\dev\jna\jna-platform\4.1.0\jna-platform-4.1.0.jar, C:\Users\ufo_bamboo_agent\.m2\repository\commons-io\commons-io\2.5\commons-io-2.5.jar, C:\Users\ufo_bamboo_agent\.m2\repository\org\testng\testng\6.11\testng-6.11.jar, C:\Users\ufo_bamboo_agent\.m2\repository\com\beust\jcommander\1.64\jcommander-1.64.jar, C:\Users\ufo_bamboo_agent\.m2\repository\org\yaml\snakeyaml\1.17\snakeyaml-1.17.jar, C:\Users\ufo_bamboo_agent\.m2\repository\org\uncommons\reportng\1.1.4\reportng-1.1.4.jar, C:\Users\ufo_bamboo_agent\.m2\repository\velocity\velocity\1.4\velocity-1.4.jar, C:\Users\ufo_bamboo_agent\.m2\repository\com\microsoft\sqlserver\mssql-jdbc\6.2.2.jre8\mssql-jdbc-6.2.2.jre8.jar, C:\Users\ufo_bamboo_agent\.m2\repository\com\google\inject\guice\4.1.0\guice-4.1.0.jar, C:\Users\ufo_bamboo_agent\.m2\repository\javax\inject\javax.inject\1\javax.inject-1.jar, C:\Users\ufo_bamboo_agent\.m2\repository\aopalliance\aopalliance\1.0\aopalliance-1.0.jar, C:\Users\ufo_bamboo_agent\.m2\repository\log4j\log4j\1.2.17\log4j-1.2.17.jar, C:\Users\ufo_bamboo_agent\.m2\repository\ru\yandex\qatools\ashot\ashot\1.5.4\ashot-1.5.4.jar, C:\Users\ufo_bamboo_agent\.m2\repository\org\hamcrest\hamcrest-core\1.3\hamcrest-core-1.3.jar]
[DEBUG]   (f) compileSourceRoots = [C:\underwriterTest\src\test\java]
[DEBUG]   (f) compilerId = javac
[DEBUG]   (f) debug = true
[DEBUG]   (f) encoding = UTF-8
[DEBUG]   (f) failOnError = true
[DEBUG]   (f) failOnWarning = false
[DEBUG]   (f) forceJavacCompilerUse = false
[DEBUG]   (f) fork = false
[DEBUG]   (f) generatedTestSourcesDirectory = C:\underwriterTest\target\generated-test-sources\test-annotations
[DEBUG]   (f) mojoExecution = org.apache.maven.plugins:maven-compiler-plugin:3.7.0:testCompile {execution: default-testCompile}
[DEBUG]   (f) optimize = false
[DEBUG]   (f) outputDirectory = C:\underwriterTest\target\test-classes
[DEBUG]   (f) parameters = false
[DEBUG]   (f) project = MavenProject: com.epam:UFOTests:1.0 @ C:\underwriterTest\pom.xml
[DEBUG]   (f) session = org.apache.maven.execution.MavenSession@41c62850
[DEBUG]   (f) showDeprecation = false
[DEBUG]   (f) showWarnings = false
[DEBUG]   (f) skipMultiThreadWarning = false
[DEBUG]   (f) source = 1.8
[DEBUG]   (f) staleMillis = 0
[DEBUG]   (f) target = 1.8
[DEBUG]   (f) testPath = [C:\underwriterTest\target\test-classes, C:\underwriterTest\target\classes, C:\Users\ufo_bamboo_agent\.m2\repository\org\slf4j\slf4j-api\1.7.25\slf4j-api-1.7.25.jar, C:\Users\ufo_bamboo_agent\.m2\repository\org\slf4j\slf4j-log4j12\1.7.25\slf4j-log4j12-1.7.25.jar, C:\Users\ufo_bamboo_agent\.m2\repository\com\codeborne\selenide\4.8\selenide-4.8.jar, C:\Users\ufo_bamboo_agent\.m2\repository\io\github\bonigarcia\webdrivermanager\1.7.2\webdrivermanager-1.7.2.jar, C:\Users\ufo_bamboo_agent\.m2\repository\com\typesafe\config\1.2.1\config-1.2.1.jar, C:\Users\ufo_bamboo_agent\.m2\repository\org\apache\commons\commons-lang3\3.5\commons-lang3-3.5.jar, C:\Users\ufo_bamboo_agent\.m2\repository\org\rauschig\jarchivelib\0.7.1\jarchivelib-0.7.1.jar, C:\Users\ufo_bamboo_agent\.m2\repository\org\apache\commons\commons-compress\1.9\commons-compress-1.9.jar, C:\Users\ufo_bamboo_agent\.m2\repository\org\jsoup\jsoup\1.10.2\jsoup-1.10.2.jar, C:\Users\ufo_bamboo_agent\.m2\repository\org\apache\httpcomponents\httpcore\4.4.7\httpcore-4.4.7.jar, C:\Users\ufo_bamboo_agent\.m2\repository\org\seleniumhq\selenium\selenium-java\3.6.0\selenium-java-3.6.0.jar, C:\Users\ufo_bamboo_agent\.m2\repository\org\seleniumhq\selenium\selenium-chrome-driver\3.6.0\selenium-chrome-driver-3.6.0.jar, C:\Users\ufo_bamboo_agent\.m2\repository\org\seleniumhq\selenium\selenium-edge-driver\3.6.0\selenium-edge-driver-3.6.0.jar, C:\Users\ufo_bamboo_agent\.m2\repository\org\seleniumhq\selenium\selenium-firefox-driver\3.6.0\selenium-firefox-driver-3.6.0.jar, C:\Users\ufo_bamboo_agent\.m2\repository\org\seleniumhq\selenium\selenium-ie-driver\3.6.0\selenium-ie-driver-3.6.0.jar, C:\Users\ufo_bamboo_agent\.m2\repository\org\seleniumhq\selenium\selenium-opera-driver\3.6.0\selenium-opera-driver-3.6.0.jar, C:\Users\ufo_bamboo_agent\.m2\repository\com\google\code\gson\gson\2.8.2\gson-2.8.2.jar, C:\Users\ufo_bamboo_agent\.m2\repository\com\google\guava\guava\23.0\guava-23.0.jar, C:\Users\ufo_bamboo_agent\.m2\repository\com\google\code\findbugs\jsr305\1.3.9\jsr305-1.3.9.jar, C:\Users\ufo_bamboo_agent\.m2\repository\com\google\errorprone\error_prone_annotations\2.0.18\error_prone_annotations-2.0.18.jar, C:\Users\ufo_bamboo_agent\.m2\repository\com\google\j2objc\j2objc-annotations\1.1\j2objc-annotations-1.1.jar, C:\Users\ufo_bamboo_agent\.m2\repository\org\codehaus\mojo\animal-sniffer-annotations\1.14\animal-sniffer-annotations-1.14.jar, C:\Users\ufo_bamboo_agent\.m2\repository\net\lightbody\bmp\browsermob-core\2.1.5\browsermob-core-2.1.5.jar, C:\Users\ufo_bamboo_agent\.m2\repository\net\lightbody\bmp\littleproxy\1.1.0-beta-bmp-17\littleproxy-1.1.0-beta-bmp-17.jar, C:\Users\ufo_bamboo_agent\.m2\repository\com\fasterxml\jackson\core\jackson-core\2.8.9\jackson-core-2.8.9.jar, C:\Users\ufo_bamboo_agent\.m2\repository\com\fasterxml\jackson\core\jackson-databind\2.8.9\jackson-databind-2.8.9.jar, C:\Users\ufo_bamboo_agent\.m2\repository\com\fasterxml\jackson\core\jackson-annotations\2.8.9\jackson-annotations-2.8.9.jar, C:\Users\ufo_bamboo_agent\.m2\repository\dnsjava\dnsjava\2.1.8\dnsjava-2.1.8.jar, C:\Users\ufo_bamboo_agent\.m2\repository\org\slf4j\jcl-over-slf4j\1.7.25\jcl-over-slf4j-1.7.25.jar, C:\Users\ufo_bamboo_agent\.m2\repository\com\jcraft\jzlib\1.1.3\jzlib-1.1.3.jar, C:\Users\ufo_bamboo_agent\.m2\repository\io\netty\netty-all\4.0.51.Final\netty-all-4.0.51.Final.jar, C:\Users\ufo_bamboo_agent\.m2\repository\org\bouncycastle\bcprov-jdk15on\1.58\bcprov-jdk15on-1.58.jar, C:\Users\ufo_bamboo_agent\.m2\repository\org\bouncycastle\bcpkix-jdk15on\1.58\bcpkix-jdk15on-1.58.jar, C:\Users\ufo_bamboo_agent\.m2\repository\net\lightbody\bmp\mitm\2.1.5\mitm-2.1.5.jar, C:\Users\ufo_bamboo_agent\.m2\repository\com\codeborne\phantomjsdriver\1.4.3\phantomjsdriver-1.4.3.jar, C:\Users\ufo_bamboo_agent\.m2\repository\commons-codec\commons-codec\1.10\commons-codec-1.10.jar, C:\Users\ufo_bamboo_agent\.m2\repository\org\seleniumhq\selenium\selenium-support\3.6.0\selenium-support-3.6.0.jar, C:\Users\ufo_bamboo_agent\.m2\repository\org\seleniumhq\selenium\selenium-api\3.6.0\selenium-api-3.6.0.jar, C:\Users\ufo_bamboo_agent\.m2\repository\org\seleniumhq\selenium\selenium-remote-driver\3.6.0\selenium-remote-driver-3.6.0.jar, C:\Users\ufo_bamboo_agent\.m2\repository\net\bytebuddy\byte-buddy\1.7.5\byte-buddy-1.7.5.jar, C:\Users\ufo_bamboo_agent\.m2\repository\org\apache\commons\commons-exec\1.3\commons-exec-1.3.jar, C:\Users\ufo_bamboo_agent\.m2\repository\commons-logging\commons-logging\1.2\commons-logging-1.2.jar, C:\Users\ufo_bamboo_agent\.m2\repository\org\apache\httpcomponents\httpclient\4.5.3\httpclient-4.5.3.jar, C:\Users\ufo_bamboo_agent\.m2\repository\net\java\dev\jna\jna\4.1.0\jna-4.1.0.jar, C:\Users\ufo_bamboo_agent\.m2\repository\net\java\dev\jna\jna-platform\4.1.0\jna-platform-4.1.0.jar, C:\Users\ufo_bamboo_agent\.m2\repository\commons-io\commons-io\2.5\commons-io-2.5.jar, C:\Users\ufo_bamboo_agent\.m2\repository\org\testng\testng\6.11\testng-6.11.jar, C:\Users\ufo_bamboo_agent\.m2\repository\com\beust\jcommander\1.64\jcommander-1.64.jar, C:\Users\ufo_bamboo_agent\.m2\repository\org\yaml\snakeyaml\1.17\snakeyaml-1.17.jar, C:\Users\ufo_bamboo_agent\.m2\repository\org\uncommons\reportng\1.1.4\reportng-1.1.4.jar, C:\Users\ufo_bamboo_agent\.m2\repository\velocity\velocity\1.4\velocity-1.4.jar, C:\Users\ufo_bamboo_agent\.m2\repository\velocity\velocity-dep\1.4\velocity-dep-1.4.jar, C:\Users\ufo_bamboo_agent\.m2\repository\com\microsoft\sqlserver\mssql-jdbc\6.2.2.jre8\mssql-jdbc-6.2.2.jre8.jar, C:\Users\ufo_bamboo_agent\.m2\repository\com\google\inject\guice\4.1.0\guice-4.1.0.jar, C:\Users\ufo_bamboo_agent\.m2\repository\javax\inject\javax.inject\1\javax.inject-1.jar, C:\Users\ufo_bamboo_agent\.m2\repository\aopalliance\aopalliance\1.0\aopalliance-1.0.jar, C:\Users\ufo_bamboo_agent\.m2\repository\log4j\log4j\1.2.17\log4j-1.2.17.jar, C:\Users\ufo_bamboo_agent\.m2\repository\ru\yandex\qatools\ashot\ashot\1.5.4\ashot-1.5.4.jar, C:\Users\ufo_bamboo_agent\.m2\repository\org\hamcrest\hamcrest-core\1.3\hamcrest-core-1.3.jar]
[DEBUG]   (f) useIncrementalCompilation = true
[DEBUG]   (f) verbose = false
[DEBUG] -- end configuration --
[DEBUG] Using compiler 'javac'.
[DEBUG] Adding C:\underwriterTest\target\generated-test-sources\test-annotations to test-compile source roots:
  C:\underwriterTest\src\test\java
[DEBUG] New test-compile source roots:
  C:\underwriterTest\src\test\java
  C:\underwriterTest\target\generated-test-sources\test-annotations
[DEBUG] CompilerReuseStrategy: reuseCreated
[DEBUG] useIncrementalCompilation enabled
[INFO] Nothing to compile - all classes are up to date
[INFO] 
[INFO] --- maven-surefire-plugin:2.20.1:test (default-test) @ UFOTests ---
[DEBUG] Dependency collection stats: {ConflictMarker.analyzeTime=1, ConflictMarker.markTime=0, ConflictMarker.nodeCount=111, ConflictIdSorter.graphTime=0, ConflictIdSorter.topsortTime=0, ConflictIdSorter.conflictIdCount=34, ConflictIdSorter.conflictIdCycleCount=0, ConflictResolver.totalTime=0, ConflictResolver.conflictItemCount=76, DefaultDependencyCollector.collectTime=31, DefaultDependencyCollector.transformTime=1}
[DEBUG] org.apache.maven.plugins:maven-surefire-plugin:jar:2.20.1:
[DEBUG]    org.apache.maven.surefire:maven-surefire-common:jar:2.20.1:compile
[DEBUG]       org.apache.maven:maven-plugin-api:jar:2.2.1:compile
[DEBUG]       org.apache.maven.plugin-tools:maven-plugin-annotations:jar:3.3:compile
[DEBUG]       org.apache.maven.surefire:surefire-api:jar:2.20.1:compile
[DEBUG]          org.apache.maven.surefire:surefire-logger-api:jar:2.20.1:compile
[DEBUG]       org.apache.maven.surefire:surefire-booter:jar:2.20.1:compile
[DEBUG]       org.apache.maven:maven-artifact:jar:2.2.1:compile
[DEBUG]          org.codehaus.plexus:plexus-utils:jar:1.5.15:compile
[DEBUG]       org.apache.maven:maven-plugin-descriptor:jar:2.2.1:compile
[DEBUG]          org.codehaus.plexus:plexus-container-default:jar:1.0-alpha-9-stable-1:compile
[DEBUG]             junit:junit:jar:4.12:compile
[DEBUG]                org.hamcrest:hamcrest-core:jar:1.3:compile
[DEBUG]       org.apache.maven:maven-project:jar:2.2.1:compile
[DEBUG]          org.apache.maven:maven-settings:jar:2.2.1:compile
[DEBUG]          org.apache.maven:maven-profile:jar:2.2.1:compile
[DEBUG]          org.apache.maven:maven-artifact-manager:jar:2.2.1:compile
[DEBUG]             backport-util-concurrent:backport-util-concurrent:jar:3.1:compile
[DEBUG]          org.apache.maven:maven-plugin-registry:jar:2.2.1:compile
[DEBUG]          org.codehaus.plexus:plexus-interpolation:jar:1.11:compile
[DEBUG]       org.apache.maven:maven-model:jar:2.2.1:compile
[DEBUG]       org.apache.maven:maven-core:jar:2.2.1:compile
[DEBUG]          org.apache.maven:maven-plugin-parameter-documenter:jar:2.2.1:compile
[DEBUG]          org.slf4j:slf4j-jdk14:jar:1.5.6:runtime
[DEBUG]             org.slf4j:slf4j-api:jar:1.5.6:runtime
[DEBUG]          org.slf4j:jcl-over-slf4j:jar:1.5.6:runtime
[DEBUG]          org.apache.maven.reporting:maven-reporting-api:jar:3.0:compile
[DEBUG]          org.apache.maven:maven-repository-metadata:jar:2.2.1:compile
[DEBUG]          org.apache.maven:maven-error-diagnostics:jar:2.2.1:compile
[DEBUG]          org.apache.maven:maven-monitor:jar:2.2.1:compile
[DEBUG]          classworlds:classworlds:jar:1.1:compile
[DEBUG]          org.sonatype.plexus:plexus-sec-dispatcher:jar:1.3:compile
[DEBUG]             org.sonatype.plexus:plexus-cipher:jar:1.4:compile
[DEBUG]       org.apache.maven:maven-toolchain:jar:2.2.1:compile
[DEBUG] Created new class realm plugin>org.apache.maven.plugins:maven-surefire-plugin:2.20.1
[DEBUG] Importing foreign packages into class realm plugin>org.apache.maven.plugins:maven-surefire-plugin:2.20.1
[DEBUG]   Imported:  < maven.api
[DEBUG] Populating class realm plugin>org.apache.maven.plugins:maven-surefire-plugin:2.20.1
[DEBUG]   Included: org.apache.maven.plugins:maven-surefire-plugin:jar:2.20.1
[DEBUG]   Included: org.apache.maven.surefire:maven-surefire-common:jar:2.20.1
[DEBUG]   Included: org.apache.maven.plugin-tools:maven-plugin-annotations:jar:3.3
[DEBUG]   Included: org.apache.maven.surefire:surefire-api:jar:2.20.1
[DEBUG]   Included: org.apache.maven.surefire:surefire-logger-api:jar:2.20.1
[DEBUG]   Included: org.apache.maven.surefire:surefire-booter:jar:2.20.1
[DEBUG]   Included: org.codehaus.plexus:plexus-utils:jar:1.5.15
[DEBUG]   Included: junit:junit:jar:4.12
[DEBUG]   Included: org.hamcrest:hamcrest-core:jar:1.3
[DEBUG]   Included: backport-util-concurrent:backport-util-concurrent:jar:3.1
[DEBUG]   Included: org.codehaus.plexus:plexus-interpolation:jar:1.11
[DEBUG]   Included: org.slf4j:slf4j-jdk14:jar:1.5.6
[DEBUG]   Included: org.slf4j:jcl-over-slf4j:jar:1.5.6
[DEBUG]   Included: org.apache.maven.reporting:maven-reporting-api:jar:3.0
[DEBUG]   Included: org.sonatype.plexus:plexus-sec-dispatcher:jar:1.3
[DEBUG]   Included: org.sonatype.plexus:plexus-cipher:jar:1.4
[DEBUG] Configuring mojo org.apache.maven.plugins:maven-surefire-plugin:2.20.1:test from plugin realm ClassRealm[plugin>org.apache.maven.plugins:maven-surefire-plugin:2.20.1, parent: sun.misc.Launcher$AppClassLoader@55f96302]
[WARNING] Error injecting: org.apache.maven.plugin.surefire.SurefirePlugin
java.lang.TypeNotPresentException: Type org.apache.maven.plugin.surefire.SurefirePlugin not present
	at org.eclipse.sisu.space.URLClassSpace.loadClass(URLClassSpace.java:147)
	at org.eclipse.sisu.space.NamedClass.load(NamedClass.java:46)
	at org.eclipse.sisu.space.AbstractDeferredClass.get(AbstractDeferredClass.java:48)
	at com.google.inject.internal.ProviderInternalFactory.provision(ProviderInternalFactory.java:81)
	at com.google.inject.internal.InternalFactoryToInitializableAdapter.provision(InternalFactoryToInitializableAdapter.java:53)
	at com.google.inject.internal.ProviderInternalFactory$1.call(ProviderInternalFactory.java:65)
	at com.google.inject.internal.ProvisionListenerStackCallback$Provision.provision(ProvisionListenerStackCallback.java:115)
	at com.google.inject.internal.ProvisionListenerStackCallback$Provision.provision(ProvisionListenerStackCallback.java:133)
	at com.google.inject.internal.ProvisionListenerStackCallback.provision(ProvisionListenerStackCallback.java:68)
	at com.google.inject.internal.ProviderInternalFactory.circularGet(ProviderInternalFactory.java:63)
	at com.google.inject.internal.InternalFactoryToInitializableAdapter.get(InternalFactoryToInitializableAdapter.java:45)
	at com.google.inject.internal.InjectorImpl$2$1.call(InjectorImpl.java:1016)
	at com.google.inject.internal.InjectorImpl.callInContext(InjectorImpl.java:1092)
	at com.google.inject.internal.InjectorImpl$2.get(InjectorImpl.java:1012)
	at org.eclipse.sisu.inject.Guice4$1.get(Guice4.java:162)
	at org.eclipse.sisu.inject.LazyBeanEntry.getValue(LazyBeanEntry.java:81)
	at org.eclipse.sisu.plexus.LazyPlexusBean.getValue(LazyPlexusBean.java:51)
	at org.codehaus.plexus.DefaultPlexusContainer.lookup(DefaultPlexusContainer.java:263)
	at org.codehaus.plexus.DefaultPlexusContainer.lookup(DefaultPlexusContainer.java:255)
	at org.apache.maven.plugin.internal.DefaultMavenPluginManager.getConfiguredMojo(DefaultMavenPluginManager.java:519)
	at org.apache.maven.plugin.DefaultBuildPluginManager.executeMojo(DefaultBuildPluginManager.java:121)
	at org.apache.maven.lifecycle.internal.MojoExecutor.execute(MojoExecutor.java:208)
	at org.apache.maven.lifecycle.internal.MojoExecutor.execute(MojoExecutor.java:154)
	at org.apache.maven.lifecycle.internal.MojoExecutor.execute(MojoExecutor.java:146)
	at org.apache.maven.lifecycle.internal.LifecycleModuleBuilder.buildProject(LifecycleModuleBuilder.java:117)
	at org.apache.maven.lifecycle.internal.LifecycleModuleBuilder.buildProject(LifecycleModuleBuilder.java:81)
	at org.apache.maven.lifecycle.internal.builder.singlethreaded.SingleThreadedBuilder.build(SingleThreadedBuilder.java:51)
	at org.apache.maven.lifecycle.internal.LifecycleStarter.execute(LifecycleStarter.java:128)
	at org.apache.maven.DefaultMaven.doExecute(DefaultMaven.java:309)
	at org.apache.maven.DefaultMaven.doExecute(DefaultMaven.java:194)
	at org.apache.maven.DefaultMaven.execute(DefaultMaven.java:107)
	at org.apache.maven.cli.MavenCli.execute(MavenCli.java:993)
	at org.apache.maven.cli.MavenCli.doMain(MavenCli.java:345)
	at org.apache.maven.cli.MavenCli.main(MavenCli.java:191)
	at sun.reflect.NativeMethodAccessorImpl.invoke0(Native Method)
	at sun.reflect.NativeMethodAccessorImpl.invoke(NativeMethodAccessorImpl.java:62)
	at sun.reflect.DelegatingMethodAccessorImpl.invoke(DelegatingMethodAccessorImpl.java:43)
	at java.lang.reflect.Method.invoke(Method.java:498)
	at org.codehaus.plexus.classworlds.launcher.Launcher.launchEnhanced(Launcher.java:289)
	at org.codehaus.plexus.classworlds.launcher.Launcher.launch(Launcher.java:229)
	at org.codehaus.plexus.classworlds.launcher.Launcher.mainWithExitCode(Launcher.java:415)
	at org.codehaus.plexus.classworlds.launcher.Launcher.main(Launcher.java:356)
Caused by: java.lang.NoClassDefFoundError: org/apache/maven/plugin/surefire/SurefireReportParameters
	at java.lang.ClassLoader.defineClass1(Native Method)
	at java.lang.ClassLoader.defineClass(ClassLoader.java:763)
	at java.security.SecureClassLoader.defineClass(SecureClassLoader.java:142)
	at java.net.URLClassLoader.defineClass(URLClassLoader.java:467)
	at java.net.URLClassLoader.access$100(URLClassLoader.java:73)
	at java.net.URLClassLoader$1.run(URLClassLoader.java:368)
	at java.net.URLClassLoader$1.run(URLClassLoader.java:362)
	at java.security.AccessController.doPrivileged(Native Method)
	at java.net.URLClassLoader.findClass(URLClassLoader.java:361)
	at org.codehaus.plexus.classworlds.realm.ClassRealm.loadClassFromSelf(ClassRealm.java:401)
	at org.codehaus.plexus.classworlds.strategy.SelfFirstStrategy.loadClass(SelfFirstStrategy.java:42)
	at org.codehaus.plexus.classworlds.realm.ClassRealm.unsynchronizedLoadClass(ClassRealm.java:271)
	at org.codehaus.plexus.classworlds.realm.ClassRealm.loadClass(ClassRealm.java:247)
	at org.codehaus.plexus.classworlds.realm.ClassRealm.loadClass(ClassRealm.java:239)
	at org.codehaus.plexus.classworlds.realm.ClassRealm.loadClassFromImport(ClassRealm.java:380)
	at org.codehaus.plexus.classworlds.strategy.SelfFirstStrategy.loadClass(SelfFirstStrategy.java:38)
	at org.codehaus.plexus.classworlds.realm.ClassRealm.unsynchronizedLoadClass(ClassRealm.java:271)
	at org.codehaus.plexus.classworlds.realm.ClassRealm.loadClass(ClassRealm.java:247)
	at org.codehaus.plexus.classworlds.realm.ClassRealm.loadClass(ClassRealm.java:239)
	at org.codehaus.plexus.classworlds.realm.ClassRealm.loadClassFromImport(ClassRealm.java:380)
	at org.codehaus.plexus.classworlds.strategy.SelfFirstStrategy.loadClass(SelfFirstStrategy.java:38)
	at org.codehaus.plexus.classworlds.realm.ClassRealm.unsynchronizedLoadClass(ClassRealm.java:271)
	at org.codehaus.plexus.classworlds.realm.ClassRealm.loadClass(ClassRealm.java:247)
	at org.codehaus.plexus.classworlds.realm.ClassRealm.loadClass(ClassRealm.java:239)
	at org.eclipse.sisu.space.URLClassSpace.loadClass(URLClassSpace.java:139)
	... 41 more
Caused by: java.lang.ClassNotFoundException: org.apache.maven.plugin.surefire.SurefireReportParameters
	at org.codehaus.plexus.classworlds.strategy.SelfFirstStrategy.loadClass(SelfFirstStrategy.java:50)
	at org.codehaus.plexus.classworlds.realm.ClassRealm.unsynchronizedLoadClass(ClassRealm.java:271)
	at org.codehaus.plexus.classworlds.realm.ClassRealm.loadClass(ClassRealm.java:247)
	at org.codehaus.plexus.classworlds.realm.ClassRealm.loadClass(ClassRealm.java:239)
	... 66 more
[INFO] ------------------------------------------------------------------------
[INFO] BUILD FAILURE
[INFO] ------------------------------------------------------------------------
[INFO] Total time: 1.774 s
[INFO] Finished at: 2017-10-25T18:11:24+03:00
[INFO] Final Memory: 12M/220M
[INFO] ------------------------------------------------------------------------
[ERROR] Failed to execute goal org.apache.maven.plugins:maven-surefire-plugin:2.20.1:test (default-test) on project UFOTests: Execution default-test of goal org.apache.maven.plugins:maven-surefire-plugin:2.20.1:test failed: Unable to load the mojo 'test' in the plugin 'org.apache.maven.plugins:maven-surefire-plugin:2.20.1'. A required class is missing: org/apache/maven/plugin/surefire/SurefireReportParameters
[ERROR] -----------------------------------------------------
[ERROR] realm =    plugin>org.apache.maven.plugins:maven-surefire-plugin:2.20.1
[ERROR] strategy = org.codehaus.plexus.classworlds.strategy.SelfFirstStrategy
[ERROR] urls[0] = file:/C:/Users/ufo_bamboo_agent/.m2/repository/org/apache/maven/plugins/maven-surefire-plugin/2.20.1/maven-surefire-plugin-2.20.1.jar
[ERROR] urls[1] = file:/C:/Users/ufo_bamboo_agent/.m2/repository/org/apache/maven/surefire/maven-surefire-common/2.20.1/maven-surefire-common-2.20.1.jar
[ERROR] urls[2] = file:/C:/Users/ufo_bamboo_agent/.m2/repository/org/apache/maven/plugin-tools/maven-plugin-annotations/3.3/maven-plugin-annotations-3.3.jar
[ERROR] urls[3] = file:/C:/Users/ufo_bamboo_agent/.m2/repository/org/apache/maven/surefire/surefire-api/2.20.1/surefire-api-2.20.1.jar
[ERROR] urls[4] = file:/C:/Users/ufo_bamboo_agent/.m2/repository/org/apache/maven/surefire/surefire-logger-api/2.20.1/surefire-logger-api-2.20.1.jar
[ERROR] urls[5] = file:/C:/Users/ufo_bamboo_agent/.m2/repository/org/apache/maven/surefire/surefire-booter/2.20.1/surefire-booter-2.20.1.jar
[ERROR] urls[6] = file:/C:/Users/ufo_bamboo_agent/.m2/repository/org/codehaus/plexus/plexus-utils/1.5.15/plexus-utils-1.5.15.jar
[ERROR] urls[7] = file:/C:/Users/ufo_bamboo_agent/.m2/repository/junit/junit/4.12/junit-4.12.jar
[ERROR] urls[8] = file:/C:/Users/ufo_bamboo_agent/.m2/repository/org/hamcrest/hamcrest-core/1.3/hamcrest-core-1.3.jar
[ERROR] urls[9] = file:/C:/Users/ufo_bamboo_agent/.m2/repository/backport-util-concurrent/backport-util-concurrent/3.1/backport-util-concurrent-3.1.jar
[ERROR] urls[10] = file:/C:/Users/ufo_bamboo_agent/.m2/repository/org/codehaus/plexus/plexus-interpolation/1.11/plexus-interpolation-1.11.jar
[ERROR] urls[11] = file:/C:/Users/ufo_bamboo_agent/.m2/repository/org/slf4j/slf4j-jdk14/1.5.6/slf4j-jdk14-1.5.6.jar
[ERROR] urls[12] = file:/C:/Users/ufo_bamboo_agent/.m2/repository/org/slf4j/jcl-over-slf4j/1.5.6/jcl-over-slf4j-1.5.6.jar
[ERROR] urls[13] = file:/C:/Users/ufo_bamboo_agent/.m2/repository/org/apache/maven/reporting/maven-reporting-api/3.0/maven-reporting-api-3.0.jar
[ERROR] urls[14] = file:/C:/Users/ufo_bamboo_agent/.m2/repository/org/sonatype/plexus/plexus-sec-dispatcher/1.3/plexus-sec-dispatcher-1.3.jar
[ERROR] urls[15] = file:/C:/Users/ufo_bamboo_agent/.m2/repository/org/sonatype/plexus/plexus-cipher/1.4/plexus-cipher-1.4.jar
[ERROR] Number of foreign imports: 1
[ERROR] import: Entry[import  from realm ClassRealm[maven.api, parent: null]]
[ERROR] 
[ERROR] -----------------------------------------------------
[ERROR] : org.apache.maven.plugin.surefire.SurefireReportParameters
[ERROR] -> [Help 1]
org.apache.maven.lifecycle.LifecycleExecutionException: Failed to execute goal org.apache.maven.plugins:maven-surefire-plugin:2.20.1:test (default-test) on project UFOTests: Execution default-test of goal org.apache.maven.plugins:maven-surefire-plugin:2.20.1:test failed: Unable to load the mojo 'test' in the plugin 'org.apache.maven.plugins:maven-surefire-plugin:2.20.1'. A required class is missing: org/apache/maven/plugin/surefire/SurefireReportParameters
-----------------------------------------------------
realm =    plugin>org.apache.maven.plugins:maven-surefire-plugin:2.20.1
strategy = org.codehaus.plexus.classworlds.strategy.SelfFirstStrategy
urls[0] = file:/C:/Users/ufo_bamboo_agent/.m2/repository/org/apache/maven/plugins/maven-surefire-plugin/2.20.1/maven-surefire-plugin-2.20.1.jar
urls[1] = file:/C:/Users/ufo_bamboo_agent/.m2/repository/org/apache/maven/surefire/maven-surefire-common/2.20.1/maven-surefire-common-2.20.1.jar
urls[2] = file:/C:/Users/ufo_bamboo_agent/.m2/repository/org/apache/maven/plugin-tools/maven-plugin-annotations/3.3/maven-plugin-annotations-3.3.jar
urls[3] = file:/C:/Users/ufo_bamboo_agent/.m2/repository/org/apache/maven/surefire/surefire-api/2.20.1/surefire-api-2.20.1.jar
urls[4] = file:/C:/Users/ufo_bamboo_agent/.m2/repository/org/apache/maven/surefire/surefire-logger-api/2.20.1/surefire-logger-api-2.20.1.jar
urls[5] = file:/C:/Users/ufo_bamboo_agent/.m2/repository/org/apache/maven/surefire/surefire-booter/2.20.1/surefire-booter-2.20.1.jar
urls[6] = file:/C:/Users/ufo_bamboo_agent/.m2/repository/org/codehaus/plexus/plexus-utils/1.5.15/plexus-utils-1.5.15.jar
urls[7] = file:/C:/Users/ufo_bamboo_agent/.m2/repository/junit/junit/4.12/junit-4.12.jar
urls[8] = file:/C:/Users/ufo_bamboo_agent/.m2/repository/org/hamcrest/hamcrest-core/1.3/hamcrest-core-1.3.jar
urls[9] = file:/C:/Users/ufo_bamboo_agent/.m2/repository/backport-util-concurrent/backport-util-concurrent/3.1/backport-util-concurrent-3.1.jar
urls[10] = file:/C:/Users/ufo_bamboo_agent/.m2/repository/org/codehaus/plexus/plexus-interpolation/1.11/plexus-interpolation-1.11.jar
urls[11] = file:/C:/Users/ufo_bamboo_agent/.m2/repository/org/slf4j/slf4j-jdk14/1.5.6/slf4j-jdk14-1.5.6.jar
urls[12] = file:/C:/Users/ufo_bamboo_agent/.m2/repository/org/slf4j/jcl-over-slf4j/1.5.6/jcl-over-slf4j-1.5.6.jar
urls[13] = file:/C:/Users/ufo_bamboo_agent/.m2/repository/org/apache/maven/reporting/maven-reporting-api/3.0/maven-reporting-api-3.0.jar
urls[14] = file:/C:/Users/ufo_bamboo_agent/.m2/repository/org/sonatype/plexus/plexus-sec-dispatcher/1.3/plexus-sec-dispatcher-1.3.jar
urls[15] = file:/C:/Users/ufo_bamboo_agent/.m2/repository/org/sonatype/plexus/plexus-cipher/1.4/plexus-cipher-1.4.jar
Number of foreign imports: 1
import: Entry[import  from realm ClassRealm[maven.api, parent: null]]

-----------------------------------------------------

	at org.apache.maven.lifecycle.internal.MojoExecutor.execute(MojoExecutor.java:213)
	at org.apache.maven.lifecycle.internal.MojoExecutor.execute(MojoExecutor.java:154)
	at org.apache.maven.lifecycle.internal.MojoExecutor.execute(MojoExecutor.java:146)
	at org.apache.maven.lifecycle.internal.LifecycleModuleBuilder.buildProject(LifecycleModuleBuilder.java:117)
	at org.apache.maven.lifecycle.internal.LifecycleModuleBuilder.buildProject(LifecycleModuleBuilder.java:81)
	at org.apache.maven.lifecycle.internal.builder.singlethreaded.SingleThreadedBuilder.build(SingleThreadedBuilder.java:51)
	at org.apache.maven.lifecycle.internal.LifecycleStarter.execute(LifecycleStarter.java:128)
	at org.apache.maven.DefaultMaven.doExecute(DefaultMaven.java:309)
	at org.apache.maven.DefaultMaven.doExecute(DefaultMaven.java:194)
	at org.apache.maven.DefaultMaven.execute(DefaultMaven.java:107)
	at org.apache.maven.cli.MavenCli.execute(MavenCli.java:993)
	at org.apache.maven.cli.MavenCli.doMain(MavenCli.java:345)
	at org.apache.maven.cli.MavenCli.main(MavenCli.java:191)
	at sun.reflect.NativeMethodAccessorImpl.invoke0(Native Method)
	at sun.reflect.NativeMethodAccessorImpl.invoke(NativeMethodAccessorImpl.java:62)
	at sun.reflect.DelegatingMethodAccessorImpl.invoke(DelegatingMethodAccessorImpl.java:43)
	at java.lang.reflect.Method.invoke(Method.java:498)
	at org.codehaus.plexus.classworlds.launcher.Launcher.launchEnhanced(Launcher.java:289)
	at org.codehaus.plexus.classworlds.launcher.Launcher.launch(Launcher.java:229)
	at org.codehaus.plexus.classworlds.launcher.Launcher.mainWithExitCode(Launcher.java:415)
	at org.codehaus.plexus.classworlds.launcher.Launcher.main(Launcher.java:356)
Caused by: org.apache.maven.plugin.PluginExecutionException: Execution default-test of goal org.apache.maven.plugins:maven-surefire-plugin:2.20.1:test failed: Unable to load the mojo 'test' in the plugin 'org.apache.maven.plugins:maven-surefire-plugin:2.20.1'. A required class is missing: org/apache/maven/plugin/surefire/SurefireReportParameters
-----------------------------------------------------
realm =    plugin>org.apache.maven.plugins:maven-surefire-plugin:2.20.1
strategy = org.codehaus.plexus.classworlds.strategy.SelfFirstStrategy
urls[0] = file:/C:/Users/ufo_bamboo_agent/.m2/repository/org/apache/maven/plugins/maven-surefire-plugin/2.20.1/maven-surefire-plugin-2.20.1.jar
urls[1] = file:/C:/Users/ufo_bamboo_agent/.m2/repository/org/apache/maven/surefire/maven-surefire-common/2.20.1/maven-surefire-common-2.20.1.jar
urls[2] = file:/C:/Users/ufo_bamboo_agent/.m2/repository/org/apache/maven/plugin-tools/maven-plugin-annotations/3.3/maven-plugin-annotations-3.3.jar
urls[3] = file:/C:/Users/ufo_bamboo_agent/.m2/repository/org/apache/maven/surefire/surefire-api/2.20.1/surefire-api-2.20.1.jar
urls[4] = file:/C:/Users/ufo_bamboo_agent/.m2/repository/org/apache/maven/surefire/surefire-logger-api/2.20.1/surefire-logger-api-2.20.1.jar
urls[5] = file:/C:/Users/ufo_bamboo_agent/.m2/repository/org/apache/maven/surefire/surefire-booter/2.20.1/surefire-booter-2.20.1.jar
urls[6] = file:/C:/Users/ufo_bamboo_agent/.m2/repository/org/codehaus/plexus/plexus-utils/1.5.15/plexus-utils-1.5.15.jar
urls[7] = file:/C:/Users/ufo_bamboo_agent/.m2/repository/junit/junit/4.12/junit-4.12.jar
urls[8] = file:/C:/Users/ufo_bamboo_agent/.m2/repository/org/hamcrest/hamcrest-core/1.3/hamcrest-core-1.3.jar
urls[9] = file:/C:/Users/ufo_bamboo_agent/.m2/repository/backport-util-concurrent/backport-util-concurrent/3.1/backport-util-concurrent-3.1.jar
urls[10] = file:/C:/Users/ufo_bamboo_agent/.m2/repository/org/codehaus/plexus/plexus-interpolation/1.11/plexus-interpolation-1.11.jar
urls[11] = file:/C:/Users/ufo_bamboo_agent/.m2/repository/org/slf4j/slf4j-jdk14/1.5.6/slf4j-jdk14-1.5.6.jar
urls[12] = file:/C:/Users/ufo_bamboo_agent/.m2/repository/org/slf4j/jcl-over-slf4j/1.5.6/jcl-over-slf4j-1.5.6.jar
urls[13] = file:/C:/Users/ufo_bamboo_agent/.m2/repository/org/apache/maven/reporting/maven-reporting-api/3.0/maven-reporting-api-3.0.jar
urls[14] = file:/C:/Users/ufo_bamboo_agent/.m2/repository/org/sonatype/plexus/plexus-sec-dispatcher/1.3/plexus-sec-dispatcher-1.3.jar
urls[15] = file:/C:/Users/ufo_bamboo_agent/.m2/repository/org/sonatype/plexus/plexus-cipher/1.4/plexus-cipher-1.4.jar
Number of foreign imports: 1
import: Entry[import  from realm ClassRealm[maven.api, parent: null]]

-----------------------------------------------------

	at org.apache.maven.plugin.DefaultBuildPluginManager.executeMojo(DefaultBuildPluginManager.java:153)
	at org.apache.maven.lifecycle.internal.MojoExecutor.execute(MojoExecutor.java:208)
	... 20 more
Caused by: org.apache.maven.plugin.PluginContainerException: Unable to load the mojo 'test' in the plugin 'org.apache.maven.plugins:maven-surefire-plugin:2.20.1'. A required class is missing: org/apache/maven/plugin/surefire/SurefireReportParameters
-----------------------------------------------------
realm =    plugin>org.apache.maven.plugins:maven-surefire-plugin:2.20.1
strategy = org.codehaus.plexus.classworlds.strategy.SelfFirstStrategy
urls[0] = file:/C:/Users/ufo_bamboo_agent/.m2/repository/org/apache/maven/plugins/maven-surefire-plugin/2.20.1/maven-surefire-plugin-2.20.1.jar
urls[1] = file:/C:/Users/ufo_bamboo_agent/.m2/repository/org/apache/maven/surefire/maven-surefire-common/2.20.1/maven-surefire-common-2.20.1.jar
urls[2] = file:/C:/Users/ufo_bamboo_agent/.m2/repository/org/apache/maven/plugin-tools/maven-plugin-annotations/3.3/maven-plugin-annotations-3.3.jar
urls[3] = file:/C:/Users/ufo_bamboo_agent/.m2/repository/org/apache/maven/surefire/surefire-api/2.20.1/surefire-api-2.20.1.jar
urls[4] = file:/C:/Users/ufo_bamboo_agent/.m2/repository/org/apache/maven/surefire/surefire-logger-api/2.20.1/surefire-logger-api-2.20.1.jar
urls[5] = file:/C:/Users/ufo_bamboo_agent/.m2/repository/org/apache/maven/surefire/surefire-booter/2.20.1/surefire-booter-2.20.1.jar
urls[6] = file:/C:/Users/ufo_bamboo_agent/.m2/repository/org/codehaus/plexus/plexus-utils/1.5.15/plexus-utils-1.5.15.jar
urls[7] = file:/C:/Users/ufo_bamboo_agent/.m2/repository/junit/junit/4.12/junit-4.12.jar
urls[8] = file:/C:/Users/ufo_bamboo_agent/.m2/repository/org/hamcrest/hamcrest-core/1.3/hamcrest-core-1.3.jar
urls[9] = file:/C:/Users/ufo_bamboo_agent/.m2/repository/backport-util-concurrent/backport-util-concurrent/3.1/backport-util-concurrent-3.1.jar
urls[10] = file:/C:/Users/ufo_bamboo_agent/.m2/repository/org/codehaus/plexus/plexus-interpolation/1.11/plexus-interpolation-1.11.jar
urls[11] = file:/C:/Users/ufo_bamboo_agent/.m2/repository/org/slf4j/slf4j-jdk14/1.5.6/slf4j-jdk14-1.5.6.jar
urls[12] = file:/C:/Users/ufo_bamboo_agent/.m2/repository/org/slf4j/jcl-over-slf4j/1.5.6/jcl-over-slf4j-1.5.6.jar
urls[13] = file:/C:/Users/ufo_bamboo_agent/.m2/repository/org/apache/maven/reporting/maven-reporting-api/3.0/maven-reporting-api-3.0.jar
urls[14] = file:/C:/Users/ufo_bamboo_agent/.m2/repository/org/sonatype/plexus/plexus-sec-dispatcher/1.3/plexus-sec-dispatcher-1.3.jar
urls[15] = file:/C:/Users/ufo_bamboo_agent/.m2/repository/org/sonatype/plexus/plexus-cipher/1.4/plexus-cipher-1.4.jar
Number of foreign imports: 1
import: Entry[import  from realm ClassRealm[maven.api, parent: null]]

-----------------------------------------------------

	at org.apache.maven.plugin.internal.DefaultMavenPluginManager.getConfiguredMojo(DefaultMavenPluginManager.java:539)
	at org.apache.maven.plugin.DefaultBuildPluginManager.executeMojo(DefaultBuildPluginManager.java:121)
	... 21 more
Caused by: java.lang.NoClassDefFoundError: org/apache/maven/plugin/surefire/SurefireReportParameters
	at java.lang.ClassLoader.defineClass1(Native Method)
	at java.lang.ClassLoader.defineClass(ClassLoader.java:763)
	at java.security.SecureClassLoader.defineClass(SecureClassLoader.java:142)
	at java.net.URLClassLoader.defineClass(URLClassLoader.java:467)
	at java.net.URLClassLoader.access$100(URLClassLoader.java:73)
	at java.net.URLClassLoader$1.run(URLClassLoader.java:368)
	at java.net.URLClassLoader$1.run(URLClassLoader.java:362)
	at java.security.AccessController.doPrivileged(Native Method)
	at java.net.URLClassLoader.findClass(URLClassLoader.java:361)
	at org.codehaus.plexus.classworlds.realm.ClassRealm.loadClassFromSelf(ClassRealm.java:401)
	at org.codehaus.plexus.classworlds.strategy.SelfFirstStrategy.loadClass(SelfFirstStrategy.java:42)
	at org.codehaus.plexus.classworlds.realm.ClassRealm.unsynchronizedLoadClass(ClassRealm.java:271)
	at org.codehaus.plexus.classworlds.realm.ClassRealm.loadClass(ClassRealm.java:247)
	at org.codehaus.plexus.classworlds.realm.ClassRealm.loadClass(ClassRealm.java:239)
	at org.codehaus.plexus.classworlds.realm.ClassRealm.loadClassFromImport(ClassRealm.java:380)
	at org.codehaus.plexus.classworlds.strategy.SelfFirstStrategy.loadClass(SelfFirstStrategy.java:38)
	at org.codehaus.plexus.classworlds.realm.ClassRealm.unsynchronizedLoadClass(ClassRealm.java:271)
	at org.codehaus.plexus.classworlds.realm.ClassRealm.loadClass(ClassRealm.java:247)
	at org.codehaus.plexus.classworlds.realm.ClassRealm.loadClass(ClassRealm.java:239)
	at org.codehaus.plexus.classworlds.realm.ClassRealm.loadClassFromImport(ClassRealm.java:380)
	at org.codehaus.plexus.classworlds.strategy.SelfFirstStrategy.loadClass(SelfFirstStrategy.java:38)
	at org.codehaus.plexus.classworlds.realm.ClassRealm.unsynchronizedLoadClass(ClassRealm.java:271)
	at org.codehaus.plexus.classworlds.realm.ClassRealm.loadClass(ClassRealm.java:247)
	at org.codehaus.plexus.classworlds.realm.ClassRealm.loadClass(ClassRealm.java:239)
	at org.eclipse.sisu.space.URLClassSpace.loadClass(URLClassSpace.java:139)
	at org.eclipse.sisu.space.NamedClass.load(NamedClass.java:46)
	at org.eclipse.sisu.space.AbstractDeferredClass.get(AbstractDeferredClass.java:48)
	at com.google.inject.internal.ProviderInternalFactory.provision(ProviderInternalFactory.java:81)
	at com.google.inject.internal.InternalFactoryToInitializableAdapter.provision(InternalFactoryToInitializableAdapter.java:53)
	at com.google.inject.internal.ProviderInternalFactory$1.call(ProviderInternalFactory.java:65)
	at com.google.inject.internal.ProvisionListenerStackCallback$Provision.provision(ProvisionListenerStackCallback.java:115)
	at com.google.inject.internal.ProvisionListenerStackCallback$Provision.provision(ProvisionListenerStackCallback.java:133)
	at com.google.inject.internal.ProvisionListenerStackCallback.provision(ProvisionListenerStackCallback.java:68)
	at com.google.inject.internal.ProviderInternalFactory.circularGet(ProviderInternalFactory.java:63)
	at com.google.inject.internal.InternalFactoryToInitializableAdapter.get(InternalFactoryToInitializableAdapter.java:45)
	at com.google.inject.internal.InjectorImpl$2$1.call(InjectorImpl.java:1016)
	at com.google.inject.internal.InjectorImpl.callInContext(InjectorImpl.java:1092)
	at com.google.inject.internal.InjectorImpl$2.get(InjectorImpl.java:1012)
	at org.eclipse.sisu.inject.Guice4$1.get(Guice4.java:162)
	at org.eclipse.sisu.inject.LazyBeanEntry.getValue(LazyBeanEntry.java:81)
	at org.eclipse.sisu.plexus.LazyPlexusBean.getValue(LazyPlexusBean.java:51)
	at org.codehaus.plexus.DefaultPlexusContainer.lookup(DefaultPlexusContainer.java:263)
	at org.codehaus.plexus.DefaultPlexusContainer.lookup(DefaultPlexusContainer.java:255)
	at org.apache.maven.plugin.internal.DefaultMavenPluginManager.getConfiguredMojo(DefaultMavenPluginManager.java:519)
	... 22 more
Caused by: java.lang.ClassNotFoundException: org.apache.maven.plugin.surefire.SurefireReportParameters
	at org.codehaus.plexus.classworlds.strategy.SelfFirstStrategy.loadClass(SelfFirstStrategy.java:50)
	at org.codehaus.plexus.classworlds.realm.ClassRealm.unsynchronizedLoadClass(ClassRealm.java:271)
	at org.codehaus.plexus.classworlds.realm.ClassRealm.loadClass(ClassRealm.java:247)
	at org.codehaus.plexus.classworlds.realm.ClassRealm.loadClass(ClassRealm.java:239)
	... 66 more
[ERROR] 
[ERROR] 
[ERROR] For more information about the errors and possible solutions, please read the following articles:
[ERROR] [Help 1] http://cwiki.apache.org/confluence/display/MAVEN/PluginContainerException

Пыталась воспроизвести на своем ноутбуке без Интернета, все собралось.

Спасибо!


Ошибка "Failed to execute goal org.apache.maven.plugins:maven-surefire-plugin:2.20.1:test " при сборке Maven
(Vasiliy Rakshin) #2

добавьте тег -o при сборке (mvn -o la-lalalal)
он означает смотреть только в локальный репозиторий

но надо чтобы в C:\Users\ufo_bamboo_agent\.m2\repository было всё что нужно скопировано с машины с интернетом


(Татьяна Иванова) #3

Убрала из транзитивных зависимостей Maven testng

<dependency>
			<groupId>org.uncommons</groupId>
			<artifactId>reportng</artifactId>
			<version>1.1.4</version>
			<exclusions>
				<exclusion>
					<groupId>org.testng</groupId>
					<artifactId>testng</artifactId>
				</exclusion>
			</exclusions>
		</dependency>

Ошибка ушла.


(Татьяна Иванова) #4

Спасибо за ответ!