t.me/atinfo_chat Telegram группа по автоматизации тестирования

Не как не получаеться создать отчёт Allure ?

Теги: #<Tag:0x00007fd76930e498> #<Tag:0x00007fd76930e3d0> #<Tag:0x00007fd76930e2e0>

Какой командой запускаете?
Давайте тогда полные строки ошибки.

команда для запуска

mvn clean test site

Ошибки

[INFO] Scanning for projects...
[INFO]
[INFO] ------------------------------------------------------------------------
[INFO] Building WebDriver 0.0.1-SNAPSHOT
[INFO] ------------------------------------------------------------------------
[INFO] ------------------------------------------------------------------------
[INFO] BUILD FAILURE
[INFO] ------------------------------------------------------------------------
[INFO] Total time: 0.775 s
[INFO] Finished at: 2017-07-17T14:52:19+03:00
[INFO] Final Memory: 7M/77M
[INFO] ------------------------------------------------------------------------
[ERROR] 11850
[ERROR]
[ERROR] To see the full stack trace of the errors, re-run Maven with the -e swit
ch.
[ERROR] Re-run Maven using the -X switch to enable full debug logging.

Запустите пока mvn --errors clean test
а потом как тест завершится mvn --errors site
и будет нормальное сообщение об ошибке