Thucydides: Не проходит тест с примером (Firefox)

thucydides
Теги: #<Tag:0x00007fedc7a674a0>

(Maxim Fokin) #1

Создал Maven проект с архетипом Thucydides.
При прогоне теста с примером открывается окно с firefox и ничего не происходит.
Через какое-то время валится с ошибкой:

Results :

    Tests in error: 
      searching_by_keyword_banana_should_display_the_corresponding_article(ux.SearchByKeywordStoryTest): Could not instantiate class org.openqa.selenium.firefox.FirefoxDriver
      searching_by_keyword_apple_should_display_the_corresponding_article(ux.SearchByKeywordStoryTest): Could not instantiate class org.openqa.selenium.firefox.FirefoxDriver
    
    Tests run: 3, Failures: 0, Errors: 2, Skipped: 0

Никто не сталкивался?


(Maxim Fokin) #2

Полный лог

 at org.apache.maven.surefire.junitcore.ClassDemarcatingRunner.run(ClassDemarcatingRunner.java:58)
	at org.junit.runners.Suite.runChild(Suite.java:127)
	at org.junit.runners.Suite.runChild(Suite.java:26)
	at org.junit.runners.ParentRunner$3.run(ParentRunner.java:238)
	at java.util.concurrent.Executors$RunnableAdapter.call(Executors.java:511)
	at java.util.concurrent.FutureTask.run(FutureTask.java:266)
	at java.util.concurrent.ThreadPoolExecutor.runWorker(ThreadPoolExecutor.java:1142)
	at java.util.concurrent.ThreadPoolExecutor$Worker.run(ThreadPoolExecutor.java:617)
	at java.lang.Thread.run(Thread.java:745)
198742 [pool-1-thread-1] ERROR net.thucydides.core.webdriver.WebDriverFacade - FAILED TO CREATE NEW WEBDRIVER_DRIVER INSTANCE class org.openqa.selenium.firefox.FirefoxDriver: Could not instantiate class org.openqa.selenium.firefox.FirefoxDriver
net.thucydides.core.webdriver.UnsupportedDriverException: Could not instantiate class org.openqa.selenium.firefox.FirefoxDriver
	at net.thucydides.core.webdriver.WebDriverFactory.newWebdriverInstance(WebDriverFactory.java:192)
	at net.thucydides.core.webdriver.WebDriverFacade.newDriverInstance(WebDriverFacade.java:88)
	at net.thucydides.core.webdriver.WebDriverFacade.newProxyDriver(WebDriverFacade.java:82)
	at net.thucydides.core.webdriver.WebDriverFacade.getProxiedDriver(WebDriverFacade.java:54)
	at net.thucydides.core.webdriver.WebDriverFacade.openIgnoringHtmlUnitScriptErrors(WebDriverFacade.java:123)
	at net.thucydides.core.webdriver.WebDriverFacade.get(WebDriverFacade.java:118)
	at net.thucydides.core.pages.PageObject.openPageAtUrl(PageObject.java:732)
	at net.thucydides.core.pages.PageObject.open(PageObject.java:642)
	at net.thucydides.core.pages.PageObject.open(PageObject.java:630)
	at ux.steps.EndUserSteps.is_the_home_page(EndUserSteps.java:34)
	at ux.steps.EndUserSteps$$EnhancerByCGLIB$$c606754b.CGLIB$is_the_home_page$2(<generated>)
	at ux.steps.EndUserSteps$$EnhancerByCGLIB$$c606754b$$FastClassByCGLIB$$b73888b8.invoke(<generated>)
	at net.sf.cglib.proxy.MethodProxy.invokeSuper(MethodProxy.java:228)
	at net.thucydides.core.steps.StepInterceptor.invokeMethod(StepInterceptor.java:300)
	at net.thucydides.core.steps.StepInterceptor.executeTestStepMethod(StepInterceptor.java:285)
	at net.thucydides.core.steps.StepInterceptor.runTestStep(StepInterceptor.java:261)
	at net.thucydides.core.steps.StepInterceptor.testStepResult(StepInterceptor.java:125)
	at net.thucydides.core.steps.StepInterceptor.intercept(StepInterceptor.java:51)
	at ux.steps.EndUserSteps$$EnhancerByCGLIB$$c606754b.is_the_home_page(<generated>)
	at ux.SearchByKeywordStoryTest.searching_by_keyword_apple_should_display_the_corresponding_article(SearchByKeywordStoryTest.java:35)
	at sun.reflect.NativeMethodAccessorImpl.invoke0(Native Method)
	at sun.reflect.NativeMethodAccessorImpl.invoke(NativeMethodAccessorImpl.java:62)
	at sun.reflect.DelegatingMethodAccessorImpl.invoke(DelegatingMethodAccessorImpl.java:43)
	at java.lang.reflect.Method.invoke(Method.java:497)
	at org.junit.runners.model.FrameworkMethod$1.runReflectiveCall(FrameworkMethod.java:47)
	at org.junit.internal.runners.model.ReflectiveCallable.run(ReflectiveCallable.java:12)
	at org.junit.runners.model.FrameworkMethod.invokeExplosively(FrameworkMethod.java:44)
	at org.junit.internal.runners.statements.InvokeMethod.evaluate(InvokeMethod.java:17)
	at net.thucydides.junit.runners.ThucydidesStatement.evaluate(ThucydidesStatement.java:24)
	at org.junit.runners.ParentRunner.runLeaf(ParentRunner.java:271)
	at org.junit.runners.BlockJUnit4ClassRunner.runChild(BlockJUnit4ClassRunner.java:70)
	at net.thucydides.junit.runners.ThucydidesRunner.runChild(ThucydidesRunner.java:414)
	at org.junit.runners.BlockJUnit4ClassRunner.runChild(BlockJUnit4ClassRunner.java:50)
	at org.junit.runners.ParentRunner$3.run(ParentRunner.java:238)
	at org.junit.runners.ParentRunner$1.schedule(ParentRunner.java:63)
	at org.junit.runners.ParentRunner.runChildren(ParentRunner.java:236)
	at org.junit.runners.ParentRunner.access$000(ParentRunner.java:53)
	at org.junit.runners.ParentRunner$2.evaluate(ParentRunner.java:229)
	at org.junit.runners.ParentRunner.run(ParentRunner.java:309)
	at net.thucydides.junit.runners.ThucydidesRunner.run(ThucydidesRunner.java:229)
	at org.apache.maven.surefire.junitcore.ClassDemarcatingRunner.run(ClassDemarcatingRunner.java:58)
	at org.junit.runners.Suite.runChild(Suite.java:127)
	at org.junit.runners.Suite.runChild(Suite.java:26)
	at org.junit.runners.ParentRunner$3.run(ParentRunner.java:238)
	at java.util.concurrent.Executors$RunnableAdapter.call(Executors.java:511)
	at java.util.concurrent.FutureTask.run(FutureTask.java:266)
	at java.util.concurrent.ThreadPoolExecutor.runWorker(ThreadPoolExecutor.java:1142)
	at java.util.concurrent.ThreadPoolExecutor$Worker.run(ThreadPoolExecutor.java:617)
	at java.lang.Thread.run(Thread.java:745)
Caused by: org.openqa.selenium.WebDriverException: Failed to connect to binary FirefoxBinary(C:\Program Files (x86)\Mozilla Firefox\firefox.exe) on port 7055; process output follows: 
dons.manager	DEBUG	Loaded provider scope for resource://gre/modules/addons/PluginProvider.jsm
1444500654117	addons.manager	DEBUG	Starting provider: XPIProvider
1444500654118	addons.xpi	DEBUG	startup
1444500654119	addons.xpi	INFO	Mapping fxdriver@googlecode.com to C:\Users\2BA0~1\AppData\Local\Temp\anonymous5507895670720875991webdriver-profile\extensions\fxdriver@googlecode.com
1444500654119	addons.xpi	DEBUG	Ignoring file entry whose name is not a valid add-on ID: C:\Users\2BA0~1\AppData\Local\Temp\anonymous5507895670720875991webdriver-profile\extensions\webdriver-staging
1444500654120	addons.xpi	INFO	Mapping {972ce4c6-7e08-4474-a285-3208198ce6fd} to C:\Program Files (x86)\Mozilla Firefox\browser\extensions\{972ce4c6-7e08-4474-a285-3208198ce6fd}
1444500654120	addons.xpi	DEBUG	Skipping unavailable install location app-system-share
1444500654120	addons.xpi	DEBUG	Skipping unavailable install location app-system-local
1444500654120	addons.xpi	DEBUG	checkForChanges
1444500654121	addons.xpi	DEBUG	Loaded add-on state from prefs: {"app-profile":{"fxdriver@googlecode.com":{"d":"C:\\Users\\2BA0~1\\AppData\\Local\\Temp\\anonymous5507895670720875991webdriver-profile\\extensions\\fxdriver@googlecode.com","e":false,"v":"2.42.2","st":1444500650470,"mt":1444500650442}},"app-global":{"{972ce4c6-7e08-4474-a285-3208198ce6fd}":{"d":"C:\\Program Files (x86)\\Mozilla Firefox\\browser\\extensions\\{972ce4c6-7e08-4474-a285-3208198ce6fd}","e":true,"v":"41.0.1","st":1444493672631,"mt":1443569298000}}}
1444500654122	addons.xpi	DEBUG	getModTime: Recursive scan of {972ce4c6-7e08-4474-a285-3208198ce6fd}
1444500654123	addons.xpi	DEBUG	getInstallState changed: false, state: {"app-profile":{"fxdriver@googlecode.com":{"d":"C:\\Users\\2BA0~1\\AppData\\Local\\Temp\\anonymous5507895670720875991webdriver-profile\\extensions\\fxdriver@googlecode.com","e":false,"v":"2.42.2","st":1444500650470,"mt":1444500650442}},"app-global":{"{972ce4c6-7e08-4474-a285-3208198ce6fd}":{"d":"C:\\Program Files (x86)\\Mozilla Firefox\\browser\\extensions\\{972ce4c6-7e08-4474-a285-3208198ce6fd}","e":true,"v":"41.0.1","st":1444493672631,"mt":1443569298000}}}
1444500654124	addons.xpi	DEBUG	No changes found
1444500654130	addons.manager	DEBUG	Registering shutdown blocker for XPIProvider
1444500654131	addons.manager	DEBUG	Provider finished startup: XPIProvider
1444500654131	addons.manager	DEBUG	Starting provider: LightweightThemeManager
1444500654131	addons.manager	DEBUG	Registering shutdown blocker for LightweightThemeManager
1444500654131	addons.manager	DEBUG	Provider finished startup: LightweightThemeManager
1444500654131	addons.manager	DEBUG	Starting provider: GMPProvider
1444500654135	addons.manager	DEBUG	Registering shutdown blocker for GMPProvider
1444500654135	addons.manager	DEBUG	Provider finished startup: GMPProvider
1444500654135	addons.manager	DEBUG	Starting provider: PluginProvider
1444500654135	addons.manager	DEBUG	Registering shutdown blocker for PluginProvider
1444500654135	addons.manager	DEBUG	Provider finished startup: PluginProvider
1444500654136	addons.manager	DEBUG	Completed startup sequence
1444500654236	addons.xpi-utils	DEBUG	Starting async load of XPI database C:\Users\2BA0~1\AppData\Local\Temp\anonymous5507895670720875991webdriver-profile\extensions.json
*** Blocklist::_loadBlocklistFromFile: blocklist is disabled
1444500654346	addons.manager	DEBUG	Starting provider: <unnamed-provider>
1444500654346	addons.manager	DEBUG	Registering shutdown blocker for <unnamed-provider>
1444500654346	addons.manager	DEBUG	Provider finished startup: <unnamed-provider>
1444500654421	addons.xpi-utils	DEBUG	Async JSON file read took 0 MS
1444500654421	addons.xpi-utils	DEBUG	Finished async read of XPI database, parsing...
1444500654421	addons.xpi-utils	DEBUG	Successfully read XPI database
1444500654472	addons.manager	DEBUG	Starting provider: PreviousExperimentProvider
1444500654472	addons.manager	DEBUG	Registering shutdown blocker for PreviousExperimentProvider
1444500654473	addons.manager	DEBUG	Provider finished startup: PreviousExperimentProvider

Build info: version: '2.42.2', revision: '6a6995d31c7c56c340d6f45a76976d43506cd6cc', time: '2014-06-03 10:52:47'
System info: host: 'max', ip: '192.168.1.62', os.name: 'Windows 10', os.arch: 'amd64', os.version: '10.0', java.version: '1.8.0_60'
Driver info: driver.version: FirefoxDriver
	at org.openqa.selenium.firefox.internal.NewProfileExtensionConnection.start(NewProfileExtensionConnection.java:130)
	at org.openqa.selenium.firefox.FirefoxDriver.startClient(FirefoxDriver.java:246)
	at org.openqa.selenium.remote.RemoteWebDriver.<init>(RemoteWebDriver.java:114)
	at org.openqa.selenium.firefox.FirefoxDriver.<init>(FirefoxDriver.java:191)
	at org.openqa.selenium.firefox.FirefoxDriver.<init>(FirefoxDriver.java:186)
	at org.openqa.selenium.firefox.FirefoxDriver.<init>(FirefoxDriver.java:103)
	at net.thucydides.core.webdriver.WebdriverInstanceFactory.newFirefoxDriver(WebdriverInstanceFactory.java:32)
	at net.thucydides.core.webdriver.WebDriverFactory.firefoxDriver(WebDriverFactory.java:535)
	at net.thucydides.core.webdriver.WebDriverFactory.newWebdriverInstance(WebDriverFactory.java:169)
	... 48 more
Caused by: org.openqa.selenium.firefox.NotConnectedException: Unable to connect to host 127.0.0.1 on port 7055 after 45000 ms. Firefox console output:
dons.manager	DEBUG	Loaded provider scope for resource://gre/modules/addons/PluginProvider.jsm
1444500654117	addons.manager	DEBUG	Starting provider: XPIProvider
1444500654118	addons.xpi	DEBUG	startup
1444500654119	addons.xpi	INFO	Mapping fxdriver@googlecode.com to C:\Users\2BA0~1\AppData\Local\Temp\anonymous5507895670720875991webdriver-profile\extensions\fxdriver@googlecode.com
1444500654119	addons.xpi	DEBUG	Ignoring file entry whose name is not a valid add-on ID: C:\Users\2BA0~1\AppData\Local\Temp\anonymous5507895670720875991webdriver-profile\extensions\webdriver-staging
1444500654120	addons.xpi	INFO	Mapping {972ce4c6-7e08-4474-a285-3208198ce6fd} to C:\Program Files (x86)\Mozilla Firefox\browser\extensions\{972ce4c6-7e08-4474-a285-3208198ce6fd}
1444500654120	addons.xpi	DEBUG	Skipping unavailable install location app-system-share
1444500654120	addons.xpi	DEBUG	Skipping unavailable install location app-system-local
1444500654120	addons.xpi	DEBUG	checkForChanges
1444500654121	addons.xpi	DEBUG	Loaded add-on state from prefs: {"app-profile":{"fxdriver@googlecode.com":{"d":"C:\\Users\\2BA0~1\\AppData\\Local\\Temp\\anonymous5507895670720875991webdriver-profile\\extensions\\fxdriver@googlecode.com","e":false,"v":"2.42.2","st":1444500650470,"mt":1444500650442}},"app-global":{"{972ce4c6-7e08-4474-a285-3208198ce6fd}":{"d":"C:\\Program Files (x86)\\Mozilla Firefox\\browser\\extensions\\{972ce4c6-7e08-4474-a285-3208198ce6fd}","e":true,"v":"41.0.1","st":1444493672631,"mt":1443569298000}}}
1444500654122	addons.xpi	DEBUG	getModTime: Recursive scan of {972ce4c6-7e08-4474-a285-3208198ce6fd}
1444500654123	addons.xpi	DEBUG	getInstallState changed: false, state: {"app-profile":{"fxdriver@googlecode.com":{"d":"C:\\Users\\2BA0~1\\AppData\\Local\\Temp\\anonymous5507895670720875991webdriver-profile\\extensions\\fxdriver@googlecode.com","e":false,"v":"2.42.2","st":1444500650470,"mt":1444500650442}},"app-global":{"{972ce4c6-7e08-4474-a285-3208198ce6fd}":{"d":"C:\\Program Files (x86)\\Mozilla Firefox\\browser\\extensions\\{972ce4c6-7e08-4474-a285-3208198ce6fd}","e":true,"v":"41.0.1","st":1444493672631,"mt":1443569298000}}}
1444500654124	addons.xpi	DEBUG	No changes found
1444500654130	addons.manager	DEBUG	Registering shutdown blocker for XPIProvider
1444500654131	addons.manager	DEBUG	Provider finished startup: XPIProvider
1444500654131	addons.manager	DEBUG	Starting provider: LightweightThemeManager
1444500654131	addons.manager	DEBUG	Registering shutdown blocker for LightweightThemeManager
1444500654131	addons.manager	DEBUG	Provider finished startup: LightweightThemeManager
1444500654131	addons.manager	DEBUG	Starting provider: GMPProvider
1444500654135	addons.manager	DEBUG	Registering shutdown blocker for GMPProvider
1444500654135	addons.manager	DEBUG	Provider finished startup: GMPProvider
1444500654135	addons.manager	DEBUG	Starting provider: PluginProvider
1444500654135	addons.manager	DEBUG	Registering shutdown blocker for PluginProvider
1444500654135	addons.manager	DEBUG	Provider finished startup: PluginProvider
1444500654136	addons.manager	DEBUG	Completed startup sequence
1444500654236	addons.xpi-utils	DEBUG	Starting async load of XPI database C:\Users\2BA0~1\AppData\Local\Temp\anonymous5507895670720875991webdriver-profile\extensions.json
*** Blocklist::_loadBlocklistFromFile: blocklist is disabled
1444500654346	addons.manager	DEBUG	Starting provider: <unnamed-provider>
1444500654346	addons.manager	DEBUG	Registering shutdown blocker for <unnamed-provider>
1444500654346	addons.manager	DEBUG	Provider finished startup: <unnamed-provider>
1444500654421	addons.xpi-utils	DEBUG	Async JSON file read took 0 MS
1444500654421	addons.xpi-utils	DEBUG	Finished async read of XPI database, parsing...
1444500654421	addons.xpi-utils	DEBUG	Successfully read XPI database
1444500654472	addons.manager	DEBUG	Starting provider: PreviousExperimentProvider
1444500654472	addons.manager	DEBUG	Registering shutdown blocker for PreviousExperimentProvider
1444500654473	addons.manager	DEBUG	Provider finished startup: PreviousExperimentProvider

	at org.openqa.selenium.firefox.internal.NewProfileExtensionConnection.start(NewProfileExtensionConnection.java:118)
	... 56 more
198745 [pool-1-thread-1] INFO net.thucydides.core.steps.StepInterceptor - STEP FAILED: is_the_home_page - Could not instantiate class org.openqa.selenium.firefox.FirefoxDriver
org.openqa.selenium.firefox.NotConnectedException: Unable to connect to host 127.0.0.1 on port 7055 after 45000 ms. Firefox console output:
dons.manager	DEBUG	Loaded provider scope for resource://gre/modules/addons/PluginProvider.jsm
1444500703554	addons.manager	DEBUG	Starting provider: XPIProvider
1444500703554	addons.xpi	DEBUG	startup
1444500703555	addons.xpi	INFO	Mapping fxdriver@googlecode.com to C:\Users\2BA0~1\AppData\Local\Temp\anonymous4303322033824291901webdriver-profile\extensions\fxdriver@googlecode.com
1444500703555	addons.xpi	DEBUG	Ignoring file entry whose name is not a valid add-on ID: C:\Users\2BA0~1\AppData\Local\Temp\anonymous4303322033824291901webdriver-profile\extensions\webdriver-staging
1444500703556	addons.xpi	INFO	Mapping {972ce4c6-7e08-4474-a285-3208198ce6fd} to C:\Program Files (x86)\Mozilla Firefox\browser\extensions\{972ce4c6-7e08-4474-a285-3208198ce6fd}
1444500703556	addons.xpi	DEBUG	Skipping unavailable install location app-system-share
1444500703557	addons.xpi	DEBUG	Skipping unavailable install location app-system-local
1444500703557	addons.xpi	DEBUG	checkForChanges
1444500703557	addons.xpi	DEBUG	Loaded add-on state from prefs: {"app-profile":{"fxdriver@googlecode.com":{"d":"C:\\Users\\2BA0~1\\AppData\\Local\\Temp\\anonymous4303322033824291901webdriver-profile\\extensions\\fxdriver@googlecode.com","e":false,"v":"2.42.2","st":1444500699420,"mt":1444500699387}},"app-global":{"{972ce4c6-7e08-4474-a285-3208198ce6fd}":{"d":"C:\\Program Files (x86)\\Mozilla Firefox\\browser\\extensions\\{972ce4c6-7e08-4474-a285-3208198ce6fd}","e":true,"v":"41.0.1","st":1444493672631,"mt":1443569298000}}}
1444500703559	addons.xpi	DEBUG	getModTime: Recursive scan of {972ce4c6-7e08-4474-a285-3208198ce6fd}
1444500703561	addons.xpi	DEBUG	getInstallState changed: false, state: {"app-profile":{"fxdriver@googlecode.com":{"d":"C:\\Users\\2BA0~1\\AppData\\Local\\Temp\\anonymous4303322033824291901webdriver-profile\\extensions\\fxdriver@googlecode.com","e":false,"v":"2.42.2","st":1444500699420,"mt":1444500699387}},"app-global":{"{972ce4c6-7e08-4474-a285-3208198ce6fd}":{"d":"C:\\Program Files (x86)\\Mozilla Firefox\\browser\\extensions\\{972ce4c6-7e08-4474-a285-3208198ce6fd}","e":true,"v":"41.0.1","st":1444493672631,"mt":1443569298000}}}
1444500703562	addons.xpi	DEBUG	No changes found
1444500703568	addons.manager	DEBUG	Registering shutdown blocker for XPIProvider
1444500703568	addons.manager	DEBUG	Provider finished startup: XPIProvider
1444500703568	addons.manager	DEBUG	Starting provider: LightweightThemeManager
1444500703568	addons.manager	DEBUG	Registering shutdown blocker for LightweightThemeManager
1444500703569	addons.manager	DEBUG	Provider finished startup: LightweightThemeManager
1444500703569	addons.manager	DEBUG	Starting provider: GMPProvider
1444500703573	addons.manager	DEBUG	Registering shutdown blocker for GMPProvider
1444500703573	addons.manager	DEBUG	Provider finished startup: GMPProvider
1444500703573	addons.manager	DEBUG	Starting provider: PluginProvider
1444500703573	addons.manager	DEBUG	Registering shutdown blocker for PluginProvider
1444500703573	addons.manager	DEBUG	Provider finished startup: PluginProvider
1444500703574	addons.manager	DEBUG	Completed startup sequence
1444500703679	addons.xpi-utils	DEBUG	Starting async load of XPI database C:\Users\2BA0~1\AppData\Local\Temp\anonymous4303322033824291901webdriver-profile\extensions.json
*** Blocklist::_loadBlocklistFromFile: blocklist is disabled
1444500703799	addons.manager	DEBUG	Starting provider: <unnamed-provider>
1444500703799	addons.manager	DEBUG	Registering shutdown blocker for <unnamed-provider>
1444500703799	addons.manager	DEBUG	Provider finished startup: <unnamed-provider>
1444500703881	addons.xpi-utils	DEBUG	Async JSON file read took 0 MS
1444500703881	addons.xpi-utils	DEBUG	Finished async read of XPI database, parsing...
1444500703882	addons.xpi-utils	DEBUG	Successfully read XPI database
1444500703935	addons.manager	DEBUG	Starting provider: PreviousExperimentProvider
1444500703935	addons.manager	DEBUG	Registering shutdown blocker for PreviousExperimentProvider
1444500703935	addons.manager	DEBUG	Provider finished startup: PreviousExperimentProvider

	at org.openqa.selenium.firefox.internal.NewProfileExtensionConnection.start(NewProfileExtensionConnection.java:118)
	at org.openqa.selenium.firefox.FirefoxDriver.startClient(FirefoxDriver.java:246)
	at org.openqa.selenium.remote.RemoteWebDriver.<init>(RemoteWebDriver.java:114)
	at org.openqa.selenium.firefox.FirefoxDriver.<init>(FirefoxDriver.java:191)
	at org.openqa.selenium.firefox.FirefoxDriver.<init>(FirefoxDriver.java:186)
	at org.openqa.selenium.firefox.FirefoxDriver.<init>(FirefoxDriver.java:103)
	at net.thucydides.core.webdriver.WebdriverInstanceFactory.newFirefoxDriver(WebdriverInstanceFactory.java:32)
	at net.thucydides.core.webdriver.WebDriverFactory.firefoxDriver(WebDriverFactory.java:535)
	at net.thucydides.core.webdriver.WebDriverFactory.newWebdriverInstance(WebDriverFactory.java:169)
	at net.thucydides.core.webdriver.WebDriverFacade.newDriverInstance(WebDriverFacade.java:88)
	at net.thucydides.core.webdriver.WebDriverFacade.newProxyDriver(WebDriverFacade.java:82)
	at net.thucydides.core.webdriver.WebDriverFacade.getProxiedDriver(WebDriverFacade.java:54)
	at net.thucydides.core.webdriver.javascript.JavascriptExecutorFacade.getRealDriver(JavascriptExecutorFacade.java:143)
	at net.thucydides.core.webdriver.javascript.JavascriptExecutorFacade.getJavascriptEnabledDriver(JavascriptExecutorFacade.java:150)
	at net.thucydides.core.webdriver.javascript.JavascriptExecutorFacade.executeScript(JavascriptExecutorFacade.java:48)
	at net.thucydides.core.pages.jquery.JQueryEnabledPage.isJQueryEnabled(JQueryEnabledPage.java:41)
	at net.thucydides.core.pages.WebElementFacadeImpl.enableHighlightingIfRequired(WebElementFacadeImpl.java:831)
	at net.thucydides.core.pages.WebElementFacadeImpl.type(WebElementFacadeImpl.java:444)
	at sun.reflect.NativeMethodAccessorImpl.invoke0(Native Method)
	at sun.reflect.NativeMethodAccessorImpl.invoke(NativeMethodAccessorImpl.java:62)
	at sun.reflect.DelegatingMethodAccessorImpl.invoke(DelegatingMethodAccessorImpl.java:43)
	at java.lang.reflect.Method.invoke(Method.java:497)
	at net.thucydides.core.annotations.locators.SmartElementHandler.invoke(SmartElementHandler.java:58)
	at com.sun.proxy.$Proxy20.type(Unknown Source)
	at ux.pages.DictionaryPage.enter_keywords(DictionaryPage.java:29)
	at ux.steps.EndUserSteps.enters(EndUserSteps.java:19)
	at ux.steps.EndUserSteps$$EnhancerByCGLIB$$c606754b.CGLIB$enters$3(<generated>)
	at ux.steps.EndUserSteps$$EnhancerByCGLIB$$c606754b$$FastClassByCGLIB$$b73888b8.invoke(<generated>)
	at net.sf.cglib.proxy.MethodProxy.invokeSuper(MethodProxy.java:228)
	at net.thucydides.core.steps.StepInterceptor.invokeMethod(StepInterceptor.java:300)
	at net.thucydides.core.steps.StepInterceptor.runIfNestedMethodsShouldBeRun(StepInterceptor.java:150)
	at net.thucydides.core.steps.StepInterceptor.runSkippedMethod(StepInterceptor.java:141)
	at net.thucydides.core.steps.StepInterceptor.skipTestStep(StepInterceptor.java:131)
	at net.thucydides.core.steps.StepInterceptor.testStepResult(StepInterceptor.java:122)
	at net.thucydides.core.steps.StepInterceptor.intercept(StepInterceptor.java:51)
	at ux.steps.EndUserSteps$$EnhancerByCGLIB$$c606754b.enters(<generated>)
	at ux.steps.EndUserSteps.looks_for(EndUserSteps.java:39)
	at ux.steps.EndUserSteps$$EnhancerByCGLIB$$c606754b.CGLIB$looks_for$1(<generated>)
	at ux.steps.EndUserSteps$$EnhancerByCGLIB$$c606754b$$FastClassByCGLIB$$b73888b8.invoke(<generated>)
	at net.sf.cglib.proxy.MethodProxy.invokeSuper(MethodProxy.java:228)
	at net.thucydides.core.steps.StepInterceptor.invokeMethod(StepInterceptor.java:300)
	at net.thucydides.core.steps.StepInterceptor.runIfNestedMethodsShouldBeRun(StepInterceptor.java:150)
	at net.thucydides.core.steps.StepInterceptor.runSkippedMethod(StepInterceptor.java:141)
	at net.thucydides.core.steps.StepInterceptor.skipTestStep(StepInterceptor.java:131)
	at net.thucydides.core.steps.StepInterceptor.testStepResult(StepInterceptor.java:122)
	at net.thucydides.core.steps.StepInterceptor.intercept(StepInterceptor.java:51)
	at ux.steps.EndUserSteps$$EnhancerByCGLIB$$c606754b.looks_for(<generated>)
	at ux.SearchByKeywordStoryTest.searching_by_keyword_apple_should_display_the_corresponding_article(SearchByKeywordStoryTest.java:36)
	at sun.reflect.NativeMethodAccessorImpl.invoke0(Native Method)
	at sun.reflect.NativeMethodAccessorImpl.invoke(NativeMethodAccessorImpl.java:62)
	at sun.reflect.DelegatingMethodAccessorImpl.invoke(DelegatingMethodAccessorImpl.java:43)
	at java.lang.reflect.Method.invoke(Method.java:497)
	at org.junit.runners.model.FrameworkMethod$1.runReflectiveCall(FrameworkMethod.java:47)
	at org.junit.internal.runners.model.ReflectiveCallable.run(ReflectiveCallable.java:12)
	at org.junit.runners.model.FrameworkMethod.invokeExplosively(FrameworkMethod.java:44)
	at org.junit.internal.runners.statements.InvokeMethod.evaluate(InvokeMethod.java:17)
	at net.thucydides.junit.runners.ThucydidesStatement.evaluate(ThucydidesStatement.java:24)
	at org.junit.runners.ParentRunner.runLeaf(ParentRunner.java:271)
	at org.junit.runners.BlockJUnit4ClassRunner.runChild(BlockJUnit4ClassRunner.java:70)
	at net.thucydides.junit.runners.ThucydidesRunner.runChild(ThucydidesRunner.java:414)
	at org.junit.runners.BlockJUnit4ClassRunner.runChild(BlockJUnit4ClassRunner.java:50)
	at org.junit.runners.ParentRunner$3.run(ParentRunner.java:238)
	at org.junit.runners.ParentRunner$1.schedule(ParentRunner.java:63)
	at org.junit.runners.ParentRunner.runChildren(ParentRunner.java:236)
	at org.junit.runners.ParentRunner.access$000(ParentRunner.java:53)
	at org.junit.runners.ParentRunner$2.evaluate(ParentRunner.java:229)
	at org.junit.runners.ParentRunner.run(ParentRunner.java:309)
	at net.thucydides.junit.runners.ThucydidesRunner.run(ThucydidesRunner.java:229)
	at org.apache.maven.surefire.junitcore.ClassDemarcatingRunner.run(ClassDemarcatingRunner.java:58)
	at org.junit.runners.Suite.runChild(Suite.java:127)
	at org.junit.runners.Suite.runChild(Suite.java:26)
	at org.junit.runners.ParentRunner$3.run(ParentRunner.java:238)
	at java.util.concurrent.Executors$RunnableAdapter.call(Executors.java:511)
	at java.util.concurrent.FutureTask.run(FutureTask.java:266)
	at java.util.concurrent.ThreadPoolExecutor.runWorker(ThreadPoolExecutor.java:1142)
	at java.util.concurrent.ThreadPoolExecutor$Worker.run(ThreadPoolExecutor.java:617)
	at java.lang.Thread.run(Thread.java:745)
248214 [pool-1-thread-1] ERROR net.thucydides.core.webdriver.WebDriverFacade - FAILED TO CREATE NEW WEBDRIVER_DRIVER INSTANCE class org.openqa.selenium.firefox.FirefoxDriver: Could not instantiate class org.openqa.selenium.firefox.FirefoxDriver
net.thucydides.core.webdriver.UnsupportedDriverException: Could not instantiate class org.openqa.selenium.firefox.FirefoxDriver
	at net.thucydides.core.webdriver.WebDriverFactory.newWebdriverInstance(WebDriverFactory.java:192)
	at net.thucydides.core.webdriver.WebDriverFacade.newDriverInstance(WebDriverFacade.java:88)
	at net.thucydides.core.webdriver.WebDriverFacade.newProxyDriver(WebDriverFacade.java:82)
	at net.thucydides.core.webdriver.WebDriverFacade.getProxiedDriver(WebDriverFacade.java:54)
	at net.thucydides.core.webdriver.javascript.JavascriptExecutorFacade.getRealDriver(JavascriptExecutorFacade.java:143)
	at net.thucydides.core.webdriver.javascript.JavascriptExecutorFacade.getJavascriptEnabledDriver(JavascriptExecutorFacade.java:150)
	at net.thucydides.core.webdriver.javascript.JavascriptExecutorFacade.executeScript(JavascriptExecutorFacade.java:48)
	at net.thucydides.core.pages.jquery.JQueryEnabledPage.isJQueryEnabled(JQueryEnabledPage.java:41)
	at net.thucydides.core.pages.WebElementFacadeImpl.enableHighlightingIfRequired(WebElementFacadeImpl.java:831)
	at net.thucydides.core.pages.WebElementFacadeImpl.type(WebElementFacadeImpl.java:444)
	at sun.reflect.NativeMethodAccessorImpl.invoke0(Native Method)
	at sun.reflect.NativeMethodAccessorImpl.invoke(NativeMethodAccessorImpl.java:62)
	at sun.reflect.DelegatingMethodAccessorImpl.invoke(DelegatingMethodAccessorImpl.java:43)
	at java.lang.reflect.Method.invoke(Method.java:497)
	at net.thucydides.core.annotations.locators.SmartElementHandler.invoke(SmartElementHandler.java:58)
	at com.sun.proxy.$Proxy20.type(Unknown Source)
	at ux.pages.DictionaryPage.enter_keywords(DictionaryPage.java:29)
	at ux.steps.EndUserSteps.enters(EndUserSteps.java:19)
	at ux.steps.EndUserSteps$$EnhancerByCGLIB$$c606754b.CGLIB$enters$3(<generated>)
	at ux.steps.EndUserSteps$$EnhancerByCGLIB$$c606754b$$FastClassByCGLIB$$b73888b8.invoke(<generated>)
	at net.sf.cglib.proxy.MethodProxy.invokeSuper(MethodProxy.java:228)
	at net.thucydides.core.steps.StepInterceptor.invokeMethod(StepInterceptor.java:300)
	at net.thucydides.core.steps.StepInterceptor.runIfNestedMethodsShouldBeRun(StepInterceptor.java:150)
	at net.thucydides.core.steps.StepInterceptor.runSkippedMethod(StepInterceptor.java:141)
	at net.thucydides.core.steps.StepInterceptor.skipTestStep(StepInterceptor.java:131)
	at net.thucydides.core.steps.StepInterceptor.testStepResult(StepInterceptor.java:122)
	at net.thucydides.core.steps.StepInterceptor.intercept(StepInterceptor.java:51)
	at ux.steps.EndUserSteps$$EnhancerByCGLIB$$c606754b.enters(<generated>)
	at ux.steps.EndUserSteps.looks_for(EndUserSteps.java:39)
	at ux.steps.EndUserSteps$$EnhancerByCGLIB$$c606754b.CGLIB$looks_for$1(<generated>)
	at ux.steps.EndUserSteps$$EnhancerByCGLIB$$c606754b$$FastClassByCGLIB$$b73888b8.invoke(<generated>)
	at net.sf.cglib.proxy.MethodProxy.invokeSuper(MethodProxy.java:228)
	at net.thucydides.core.steps.StepInterceptor.invokeMethod(StepInterceptor.java:300)
	at net.thucydides.core.steps.StepInterceptor.runIfNestedMethodsShouldBeRun(StepInterceptor.java:150)
	at net.thucydides.core.steps.StepInterceptor.runSkippedMethod(StepInterceptor.java:141)
	at net.thucydides.core.steps.StepInterceptor.skipTestStep(StepInterceptor.java:131)
	at net.thucydides.core.steps.StepInterceptor.testStepResult(StepInterceptor.java:122)
	at net.thucydides.core.steps.StepInterceptor.intercept(StepInterceptor.java:51)
	at ux.steps.EndUserSteps$$EnhancerByCGLIB$$c606754b.looks_for(<generated>)
	at ux.SearchByKeywordStoryTest.searching_by_keyword_apple_should_display_the_corresponding_article(SearchByKeywordStoryTest.java:36)
	at sun.reflect.NativeMethodAccessorImpl.invoke0(Native Method)
	at sun.reflect.NativeMethodAccessorImpl.invoke(NativeMethodAccessorImpl.java:62)
	at sun.reflect.DelegatingMethodAccessorImpl.invoke(DelegatingMethodAccessorImpl.java:43)
	at java.lang.reflect.Method.invoke(Method.java:497)
	at org.junit.runners.model.FrameworkMethod$1.runReflectiveCall(FrameworkMethod.java:47)
	at org.junit.internal.runners.model.ReflectiveCallable.run(ReflectiveCallable.java:12)
	at org.junit.runners.model.FrameworkMethod.invokeExplosively(FrameworkMethod.java:44)
	at org.junit.internal.runners.statements.InvokeMethod.evaluate(InvokeMethod.java:17)
	at net.thucydides.junit.runners.ThucydidesStatement.evaluate(ThucydidesStatement.java:24)
	at org.junit.runners.ParentRunner.runLeaf(ParentRunner.java:271)
	at org.junit.runners.BlockJUnit4ClassRunner.runChild(BlockJUnit4ClassRunner.java:70)
	at net.thucydides.junit.runners.ThucydidesRunner.runChild(ThucydidesRunner.java:414)
	at org.junit.runners.BlockJUnit4ClassRunner.runChild(BlockJUnit4ClassRunner.java:50)
	at org.junit.runners.ParentRunner$3.run(ParentRunner.java:238)
	at org.junit.runners.ParentRunner$1.schedule(ParentRunner.java:63)
	at org.junit.runners.ParentRunner.runChildren(ParentRunner.java:236)
	at org.junit.runners.ParentRunner.access$000(ParentRunner.java:53)
	at org.junit.runners.ParentRunner$2.evaluate(ParentRunner.java:229)
	at org.junit.runners.ParentRunner.run(ParentRunner.java:309)
	at net.thucydides.junit.runners.ThucydidesRunner.run(ThucydidesRunner.java:229)
	at org.apache.maven.surefire.junitcore.ClassDemarcatingRunner.run(ClassDemarcatingRunner.java:58)
	at org.junit.runners.Suite.runChild(Suite.java:127)
	at org.junit.runners.Suite.runChild(Suite.java:26)
	at org.junit.runners.ParentRunner$3.run(ParentRunner.java:238)
	at java.util.concurrent.Executors$RunnableAdapter.call(Executors.java:511)
	at java.util.concurrent.FutureTask.run(FutureTask.java:266)
	at java.util.concurrent.ThreadPoolExecutor.runWorker(ThreadPoolExecutor.java:1142)
	at java.util.concurrent.ThreadPoolExecutor$Worker.run(ThreadPoolExecutor.java:617)
	at java.lang.Thread.run(Thread.java:745)
Caused by: org.openqa.selenium.WebDriverException: Failed to connect to binary FirefoxBinary(C:\Program Files (x86)\Mozilla Firefox\firefox.exe) on port 7055; process output follows: 
dons.manager	DEBUG	Loaded provider scope for resource://gre/modules/addons/PluginProvider.jsm
1444500703554	addons.manager	DEBUG	Starting provider: XPIProvider
1444500703554	addons.xpi	DEBUG	startup
1444500703555	addons.xpi	INFO	Mapping fxdriver@googlecode.com to C:\Users\2BA0~1\AppData\Local\Temp\anonymous4303322033824291901webdriver-profile\extensions\fxdriver@googlecode.com
1444500703555	addons.xpi	DEBUG	Ignoring file entry whose name is not a valid add-on ID: C:\Users\2BA0~1\AppData\Local\Temp\anonymous4303322033824291901webdriver-profile\extensions\webdriver-staging
1444500703556	addons.xpi	INFO	Mapping {972ce4c6-7e08-4474-a285-3208198ce6fd} to C:\Program Files (x86)\Mozilla Firefox\browser\extensions\{972ce4c6-7e08-4474-a285-3208198ce6fd}
1444500703556	addons.xpi	DEBUG	Skipping unavailable install location app-system-share
1444500703557	addons.xpi	DEBUG	Skipping unavailable install location app-system-local
1444500703557	addons.xpi	DEBUG	checkForChanges
1444500703557	addons.xpi	DEBUG	Loaded add-on state from prefs: {"app-profile":{"fxdriver@googlecode.com":{"d":"C:\\Users\\2BA0~1\\AppData\\Local\\Temp\\anonymous4303322033824291901webdriver-profile\\extensions\\fxdriver@googlecode.com","e":false,"v":"2.42.2","st":1444500699420,"mt":1444500699387}},"app-global":{"{972ce4c6-7e08-4474-a285-3208198ce6fd}":{"d":"C:\\Program Files (x86)\\Mozilla Firefox\\browser\\extensions\\{972ce4c6-7e08-4474-a285-3208198ce6fd}","e":true,"v":"41.0.1","st":1444493672631,"mt":1443569298000}}}
1444500703559	addons.xpi	DEBUG	getModTime: Recursive scan of {972ce4c6-7e08-4474-a285-3208198ce6fd}
1444500703561	addons.xpi	DEBUG	getInstallState changed: false, state: {"app-profile":{"fxdriver@googlecode.com":{"d":"C:\\Users\\2BA0~1\\AppData\\Local\\Temp\\anonymous4303322033824291901webdriver-profile\\extensions\\fxdriver@googlecode.com","e":false,"v":"2.42.2","st":1444500699420,"mt":1444500699387}},"app-global":{"{972ce4c6-7e08-4474-a285-3208198ce6fd}":{"d":"C:\\Program Files (x86)\\Mozilla Firefox\\browser\\extensions\\{972ce4c6-7e08-4474-a285-3208198ce6fd}","e":true,"v":"41.0.1","st":1444493672631,"mt":1443569298000}}}
1444500703562	addons.xpi	DEBUG	No changes found
1444500703568	addons.manager	DEBUG	Registering shutdown blocker for XPIProvider
1444500703568	addons.manager	DEBUG	Provider finished startup: XPIProvider
1444500703568	addons.manager	DEBUG	Starting provider: LightweightThemeManager
1444500703568	addons.manager	DEBUG	Registering shutdown blocker for LightweightThemeManager
1444500703569	addons.manager	DEBUG	Provider finished startup: LightweightThemeManager
1444500703569	addons.manager	DEBUG	Starting provider: GMPProvider
1444500703573	addons.manager	DEBUG	Registering shutdown blocker for GMPProvider
1444500703573	addons.manager	DEBUG	Provider finished startup: GMPProvider
1444500703573	addons.manager	DEBUG	Starting provider: PluginProvider
1444500703573	addons.manager	DEBUG	Registering shutdown blocker for PluginProvider
1444500703573	addons.manager	DEBUG	Provider finished startup: PluginProvider
1444500703574	addons.manager	DEBUG	Completed startup sequence
1444500703679	addons.xpi-utils	DEBUG	Starting async load of XPI database C:\Users\2BA0~1\AppData\Local\Temp\anonymous4303322033824291901webdriver-profile\extensions.json
*** Blocklist::_loadBlocklistFromFile: blocklist is disabled
1444500703799	addons.manager	DEBUG	Starting provider: <unnamed-provider>
1444500703799	addons.manager	DEBUG	Registering shutdown blocker for <unnamed-provider>
1444500703799	addons.manager	DEBUG	Provider finished startup: <unnamed-provider>
1444500703881	addons.xpi-utils	DEBUG	Async JSON file read took 0 MS
1444500703881	addons.xpi-utils	DEBUG	Finished async read of XPI database, parsing...
1444500703882	addons.xpi-utils	DEBUG	Successfully read XPI database
1444500703935	addons.manager	DEBUG	Starting provider: PreviousExperimentProvider
1444500703935	addons.manager	DEBUG	Registering shutdown blocker for PreviousExperimentProvider
1444500703935	addons.manager	DEBUG	Provider finished startup: PreviousExperimentProvider

Build info: version: '2.42.2', revision: '6a6995d31c7c56c340d6f45a76976d43506cd6cc', time: '2014-06-03 10:52:47'
System info: host: 'max', ip: '192.168.1.62', os.name: 'Windows 10', os.arch: 'amd64', os.version: '10.0', java.version: '1.8.0_60'
Driver info: driver.version: FirefoxDriver
	at org.openqa.selenium.firefox.internal.NewProfileExtensionConnection.start(NewProfileExtensionConnection.java:130)
	at org.openqa.selenium.firefox.FirefoxDriver.startClient(FirefoxDriver.java:246)
	at org.openqa.selenium.remote.RemoteWebDriver.<init>(RemoteWebDriver.java:114)
	at org.openqa.selenium.firefox.FirefoxDriver.<init>(FirefoxDriver.java:191)
	at org.openqa.selenium.firefox.FirefoxDriver.<init>(FirefoxDriver.java:186)
	at org.openqa.selenium.firefox.FirefoxDriver.<init>(FirefoxDriver.java:103)
	at net.thucydides.core.webdriver.WebdriverInstanceFactory.newFirefoxDriver(WebdriverInstanceFactory.java:32)
	at net.thucydides.core.webdriver.WebDriverFactory.firefoxDriver(WebDriverFactory.java:535)
	at net.thucydides.core.webdriver.WebDriverFactory.newWebdriverInstance(WebDriverFactory.java:169)
	... 68 more
Caused by: org.openqa.selenium.firefox.NotConnectedException: Unable to connect to host 127.0.0.1 on port 7055 after 45000 ms. Firefox console output:
dons.manager	DEBUG	Loaded provider scope for resource://gre/modules/addons/PluginProvider.jsm
1444500703554	addons.manager	DEBUG	Starting provider: XPIProvider
1444500703554	addons.xpi	DEBUG	startup
1444500703555	addons.xpi	INFO	Mapping fxdriver@googlecode.com to C:\Users\2BA0~1\AppData\Local\Temp\anonymous4303322033824291901webdriver-profile\extensions\fxdriver@googlecode.com
1444500703555	addons.xpi	DEBUG	Ignoring file entry whose name is not a valid add-on ID: C:\Users\2BA0~1\AppData\Local\Temp\anonymous4303322033824291901webdriver-profile\extensions\webdriver-staging
1444500703556	addons.xpi	INFO	Mapping {972ce4c6-7e08-4474-a285-3208198ce6fd} to C:\Program Files (x86)\Mozilla Firefox\browser\extensions\{972ce4c6-7e08-4474-a285-3208198ce6fd}
1444500703556	addons.xpi	DEBUG	Skipping unavailable install location app-system-share
1444500703557	addons.xpi	DEBUG	Skipping unavailable install location app-system-local
1444500703557	addons.xpi	DEBUG	checkForChanges
1444500703557	addons.xpi	DEBUG	Loaded add-on state from prefs: {"app-profile":{"fxdriver@googlecode.com":{"d":"C:\\Users\\2BA0~1\\AppData\\Local\\Temp\\anonymous4303322033824291901webdriver-profile\\extensions\\fxdriver@googlecode.com","e":false,"v":"2.42.2","st":1444500699420,"mt":1444500699387}},"app-global":{"{972ce4c6-7e08-4474-a285-3208198ce6fd}":{"d":"C:\\Program Files (x86)\\Mozilla Firefox\\browser\\extensions\\{972ce4c6-7e08-4474-a285-3208198ce6fd}","e":true,"v":"41.0.1","st":1444493672631,"mt":1443569298000}}}
1444500703559	addons.xpi	DEBUG	getModTime: Recursive scan of {972ce4c6-7e08-4474-a285-3208198ce6fd}
1444500703561	addons.xpi	DEBUG	getInstallState changed: false, state: {"app-profile":{"fxdriver@googlecode.com":{"d":"C:\\Users\\2BA0~1\\AppData\\Local\\Temp\\anonymous4303322033824291901webdriver-profile\\extensions\\fxdriver@googlecode.com","e":false,"v":"2.42.2","st":1444500699420,"mt":1444500699387}},"app-global":{"{972ce4c6-7e08-4474-a285-3208198ce6fd}":{"d":"C:\\Program Files (x86)\\Mozilla Firefox\\browser\\extensions\\{972ce4c6-7e08-4474-a285-3208198ce6fd}","e":true,"v":"41.0.1","st":1444493672631,"mt":1443569298000}}}
1444500703562	addons.xpi	DEBUG	No changes found
1444500703568	addons.manager	DEBUG	Registering shutdown blocker for XPIProvider
1444500703568	addons.manager	DEBUG	Provider finished startup: XPIProvider
1444500703568	addons.manager	DEBUG	Starting provider: LightweightThemeManager
1444500703568	addons.manager	DEBUG	Registering shutdown blocker for LightweightThemeManager
1444500703569	addons.manager	DEBUG	Provider finished startup: LightweightThemeManager
1444500703569	addons.manager	DEBUG	Starting provider: GMPProvider
1444500703573	addons.manager	DEBUG	Registering shutdown blocker for GMPProvider
1444500703573	addons.manager	DEBUG	Provider finished startup: GMPProvider
1444500703573	addons.manager	DEBUG	Starting provider: PluginProvider
1444500703573	addons.manager	DEBUG	Registering shutdown blocker for PluginProvider
1444500703573	addons.manager	DEBUG	Provider finished startup: PluginProvider
1444500703574	addons.manager	DEBUG	Completed startup sequence
1444500703679	addons.xpi-utils	DEBUG	Starting async load of XPI database C:\Users\2BA0~1\AppData\Local\Temp\anonymous4303322033824291901webdriver-profile\extensions.json
*** Blocklist::_loadBlocklistFromFile: blocklist is disabled
1444500703799	addons.manager	DEBUG	Starting provider: <unnamed-provider>
1444500703799	addons.manager	DEBUG	Registering shutdown blocker for <unnamed-provider>
1444500703799	addons.manager	DEBUG	Provider finished startup: <unnamed-provider>
1444500703881	addons.xpi-utils	DEBUG	Async JSON file read took 0 MS
1444500703881	addons.xpi-utils	DEBUG	Finished async read of XPI database, parsing...
1444500703882	addons.xpi-utils	DEBUG	Successfully read XPI database
1444500703935	addons.manager	DEBUG	Starting provider: PreviousExperimentProvider
1444500703935	addons.manager	DEBUG	Registering shutdown blocker for PreviousExperimentProvider
1444500703935	addons.manager	DEBUG	Provider finished startup: PreviousExperimentProvider

	at org.openqa.selenium.firefox.internal.NewProfileExtensionConnection.start(NewProfileExtensionConnection.java:118)
	... 76 more
248216 [pool-1-thread-1] INFO net.thucydides.core.steps.StepInterceptor - SKIPPED STEP: enters
org.openqa.selenium.firefox.NotConnectedException: Unable to connect to host 127.0.0.1 on port 7055 after 45000 ms. Firefox console output:
91	addons.manager	DEBUG	Loaded provider scope for resource://gre/modules/addons/PluginProvider.jsm
1444500752592	addons.manager	DEBUG	Starting provider: XPIProvider
1444500752592	addons.xpi	DEBUG	startup
1444500752593	addons.xpi	INFO	Mapping fxdriver@googlecode.com to C:\Users\2BA0~1\AppData\Local\Temp\anonymous173109902710263016webdriver-profile\extensions\fxdriver@googlecode.com
1444500752593	addons.xpi	DEBUG	Ignoring file entry whose name is not a valid add-on ID: C:\Users\2BA0~1\AppData\Local\Temp\anonymous173109902710263016webdriver-profile\extensions\webdriver-staging
1444500752594	addons.xpi	INFO	Mapping {972ce4c6-7e08-4474-a285-3208198ce6fd} to C:\Program Files (x86)\Mozilla Firefox\browser\extensions\{972ce4c6-7e08-4474-a285-3208198ce6fd}
1444500752594	addons.xpi	DEBUG	Skipping unavailable install location app-system-share
1444500752594	addons.xpi	DEBUG	Skipping unavailable install location app-system-local
1444500752595	addons.xpi	DEBUG	checkForChanges
1444500752595	addons.xpi	DEBUG	Loaded add-on state from prefs: {"app-profile":{"fxdriver@googlecode.com":{"d":"C:\\Users\\2BA0~1\\AppData\\Local\\Temp\\anonymous173109902710263016webdriver-profile\\extensions\\fxdriver@googlecode.com","e":false,"v":"2.42.2","st":1444500748997,"mt":1444500748960}},"app-global":{"{972ce4c6-7e08-4474-a285-3208198ce6fd}":{"d":"C:\\Program Files (x86)\\Mozilla Firefox\\browser\\extensions\\{972ce4c6-7e08-4474-a285-3208198ce6fd}","e":true,"v":"41.0.1","st":1444493672631,"mt":1443569298000}}}
1444500752596	addons.xpi	DEBUG	getModTime: Recursive scan of {972ce4c6-7e08-4474-a285-3208198ce6fd}
1444500752597	addons.xpi	DEBUG	getInstallState changed: false, state: {"app-profile":{"fxdriver@googlecode.com":{"d":"C:\\Users\\2BA0~1\\AppData\\Local\\Temp\\anonymous173109902710263016webdriver-profile\\extensions\\fxdriver@googlecode.com","e":false,"v":"2.42.2","st":1444500748997,"mt":1444500748960}},"app-global":{"{972ce4c6-7e08-4474-a285-3208198ce6fd}":{"d":"C:\\Program Files (x86)\\Mozilla Firefox\\browser\\extensions\\{972ce4c6-7e08-4474-a285-3208198ce6fd}","e":true,"v":"41.0.1","st":1444493672631,"mt":1443569298000}}}
1444500752598	addons.xpi	DEBUG	No changes found
1444500752609	addons.manager	DEBUG	Registering shutdown blocker for XPIProvider
1444500752609	addons.manager	DEBUG	Provider finished startup: XPIProvider
1444500752609	addons.manager	DEBUG	Starting provider: LightweightThemeManager
1444500752609	addons.manager	DEBUG	Registering shutdown blocker for LightweightThemeManager
1444500752610	addons.manager	DEBUG	Provider finished startup: LightweightThemeManager
1444500752610	addons.manager	DEBUG	Starting provider: GMPProvider
1444500752615	addons.manager	DEBUG	Registering shutdown blocker for GMPProvider
1444500752615	addons.manager	DEBUG	Provider finished startup: GMPProvider
1444500752615	addons.manager	DEBUG	Starting provider: PluginProvider
1444500752615	addons.manager	DEBUG	Registering shutdown blocker for PluginProvider
1444500752615	addons.manager	DEBUG	Provider finished startup: PluginProvider
1444500752615	addons.manager	DEBUG	Completed startup sequence
1444500752732	addons.xpi-utils	DEBUG	Starting async load of XPI database C:\Users\2BA0~1\AppData\Local\Temp\anonymous173109902710263016webdriver-profile\extensions.json
*** Blocklist::_loadBlocklistFromFile: blocklist is disabled
1444500752864	addons.manager	DEBUG	Starting provider: <unnamed-provider>
1444500752864	addons.manager	DEBUG	Registering shutdown blocker for <unnamed-provider>
1444500752864	addons.manager	DEBUG	Provider finished startup: <unnamed-provider>
1444500752956	addons.xpi-utils	DEBUG	Async JSON file read took 0 MS
1444500752957	addons.xpi-utils	DEBUG	Finished async read of XPI database, parsing...
1444500752957	addons.xpi-utils	DEBUG	Successfully read XPI database
1444500753014	addons.manager	DEBUG	Starting provider: PreviousExperimentProvider
1444500753014	addons.manager	DEBUG	Registering shutdown blocker for PreviousExperimentProvider
1444500753014	addons.manager	DEBUG	Provider finished startup: PreviousExperimentProvider

	at org.openqa.selenium.firefox.internal.NewProfileExtensionConnection.start(NewProfileExtensionConnection.java:118)
	at org.openqa.selenium.firefox.FirefoxDriver.startClient(FirefoxDriver.java:246)
	at org.openqa.selenium.remote.RemoteWebDriver.<init>(RemoteWebDriver.java:114)
	at org.openqa.selenium.firefox.FirefoxDriver.<init>(FirefoxDriver.java:191)
	at org.openqa.selenium.firefox.FirefoxDriver.<init>(FirefoxDriver.java:186)
	at org.openqa.selenium.firefox.FirefoxDriver.<init>(FirefoxDriver.java:103)
	at net.thucydides.core.webdriver.WebdriverInstanceFactory.newFirefoxDriver(WebdriverInstanceFactory.java:32)
	at net.thucydides.core.webdriver.WebDriverFactory.firefoxDriver(WebDriverFactory.java:535)
	at net.thucydides.core.webdriver.WebDriverFactory.newWebdriverInstance(WebDriverFactory.java:169)
	at net.thucydides.core.webdriver.WebDriverFacade.newDriverInstance(WebDriverFacade.java:88)
	at net.thucydides.core.webdriver.WebDriverFacade.newProxyDriver(WebDriverFacade.java:82)
	at net.thucydides.core.webdriver.WebDriverFacade.getProxiedDriver(WebDriverFacade.java:54)
	at net.thucydides.core.webdriver.javascript.JavascriptExecutorFacade.getRealDriver(JavascriptExecutorFacade.java:143)
	at net.thucydides.core.webdriver.javascript.JavascriptExecutorFacade.getJavascriptEnabledDriver(JavascriptExecutorFacade.java:150)
	at net.thucydides.core.webdriver.javascript.JavascriptExecutorFacade.executeScript(JavascriptExecutorFacade.java:48)
	at net.thucydides.core.pages.jquery.JQueryEnabledPage.isJQueryEnabled(JQueryEnabledPage.java:41)
	at net.thucydides.core.pages.WebElementFacadeImpl.enableHighlightingIfRequired(WebElementFacadeImpl.java:831)
	at net.thucydides.core.pages.WebElementFacadeImpl.click(WebElementFacadeImpl.java:793)
	at sun.reflect.NativeMethodAccessorImpl.invoke0(Native Method)
	at sun.reflect.NativeMethodAccessorImpl.invoke(NativeMethodAccessorImpl.java:62)
	at sun.reflect.DelegatingMethodAccessorImpl.invoke(DelegatingMethodAccessorImpl.java:43)
	at java.lang.reflect.Method.invoke(Method.java:497)
	at net.thucydides.core.annotations.locators.SmartElementHandler.invoke(SmartElementHandler.java:58)
	at com.sun.proxy.$Proxy20.click(Unknown Source)
	at ux.pages.DictionaryPage.lookup_terms(DictionaryPage.java:33)
	at ux.steps.EndUserSteps.starts_search(EndUserSteps.java:24)
	at ux.steps.EndUserSteps$$EnhancerByCGLIB$$c606754b.CGLIB$starts_search$4(<generated>)
	at ux.steps.EndUserSteps$$EnhancerByCGLIB$$c606754b$$FastClassByCGLIB$$b73888b8.invoke(<generated>)
	at net.sf.cglib.proxy.MethodProxy.invokeSuper(MethodProxy.java:228)
	at net.thucydides.core.steps.StepInterceptor.invokeMethod(StepInterceptor.java:300)
	at net.thucydides.core.steps.StepInterceptor.runIfNestedMethodsShouldBeRun(StepInterceptor.java:150)
	at net.thucydides.core.steps.StepInterceptor.runSkippedMethod(StepInterceptor.java:141)
	at net.thucydides.core.steps.StepInterceptor.skipTestStep(StepInterceptor.java:131)
	at net.thucydides.core.steps.StepInterceptor.testStepResult(StepInterceptor.java:122)
	at net.thucydides.core.steps.StepInterceptor.intercept(StepInterceptor.java:51)
	at ux.steps.EndUserSteps$$EnhancerByCGLIB$$c606754b.starts_search(<generated>)
	at ux.steps.EndUserSteps.looks_for(EndUserSteps.java:40)
	at ux.steps.EndUserSteps$$EnhancerByCGLIB$$c606754b.CGLIB$looks_for$1(<generated>)
	at ux.steps.EndUserSteps$$EnhancerByCGLIB$$c606754b$$FastClassByCGLIB$$b73888b8.invoke(<generated>)
	at net.sf.cglib.proxy.MethodProxy.invokeSuper(MethodProxy.java:228)
	at net.thucydides.core.steps.StepInterceptor.invokeMethod(StepInterceptor.java:300)
	at net.thucydides.core.steps.StepInterceptor.runIfNestedMethodsShouldBeRun(StepInterceptor.java:150)
	at net.thucydides.core.steps.StepInterceptor.runSkippedMethod(StepInterceptor.java:141)
	at net.thucydides.core.steps.StepInterceptor.skipTestStep(StepInterceptor.java:131)
	at net.thucydides.core.steps.StepInterceptor.testStepResult(StepInterceptor.java:122)
	at net.thucydides.core.steps.StepInterceptor.intercept(StepInterceptor.java:51)
	at ux.steps.EndUserSteps$$EnhancerByCGLIB$$c606754b.looks_for(<generated>)
	at ux.SearchByKeywordStoryTest.searching_by_keyword_apple_should_display_the_corresponding_article(SearchByKeywordStoryTest.java:36)
	at sun.reflect.NativeMethodAccessorImpl.invoke0(Native Method)
	at sun.reflect.NativeMethodAccessorImpl.invoke(NativeMethodAccessorImpl.java:62)
	at sun.reflect.DelegatingMethodAccessorImpl.invoke(DelegatingMethodAccessorImpl.java:43)
	at java.lang.reflect.Method.invoke(Method.java:497)
	at org.junit.runners.model.FrameworkMethod$1.runReflectiveCall(FrameworkMethod.java:47)
	at org.junit.internal.runners.model.ReflectiveCallable.run(ReflectiveCallable.java:12)
	at org.junit.runners.model.FrameworkMethod.invokeExplosively(FrameworkMethod.java:44)
	at org.junit.internal.runners.statements.InvokeMethod.evaluate(InvokeMethod.java:17)
	at net.thucydides.junit.runners.ThucydidesStatement.evaluate(ThucydidesStatement.java:24)
	at org.junit.runners.ParentRunner.runLeaf(ParentRunner.java:271)
	at org.junit.runners.BlockJUnit4ClassRunner.runChild(BlockJUnit4ClassRunner.java:70)
	at net.thucydides.junit.runners.ThucydidesRunner.runChild(ThucydidesRunner.java:414)
	at org.junit.runners.BlockJUnit4ClassRunner.runChild(BlockJUnit4ClassRunner.java:50)
	at org.junit.runners.ParentRunner$3.run(ParentRunner.java:238)
	at org.junit.runners.ParentRunner$1.schedule(ParentRunner.java:63)
	at org.junit.runners.ParentRunner.runChildren(ParentRunner.java:236)
	at org.junit.runners.ParentRunner.access$000(ParentRunner.java:53)
	at org.junit.runners.ParentRunner$2.evaluate(ParentRunner.java:229)
	at org.junit.runners.ParentRunner.run(ParentRunner.java:309)
	at net.thucydides.junit.runners.ThucydidesRunner.run(ThucydidesRunner.java:229)
	at org.apache.maven.surefire.junitcore.ClassDemarcatingRunner.run(ClassDemarcatingRunner.java:58)
	at org.junit.runners.Suite.runChild(Suite.java:127)
	at org.junit.runners.Suite.runChild(Suite.java:26)
	at org.junit.runners.ParentRunner$3.run(ParentRunner.java:238)
	at java.util.concurrent.Executors$RunnableAdapter.call(Executors.java:511)
	at java.util.concurrent.FutureTask.run(FutureTask.java:266)
	at java.util.concurrent.ThreadPoolExecutor.runWorker(ThreadPoolExecutor.java:1142)
	at java.util.concurrent.ThreadPoolExecutor$Worker.run(ThreadPoolExecutor.java:617)
	at java.lang.Thread.run(Thread.java:745)
297220 [pool-1-thread-1] ERROR net.thucydides.core.webdriver.WebDriverFacade - FAILED TO CREATE NEW WEBDRIVER_DRIVER INSTANCE class org.openqa.selenium.firefox.FirefoxDriver: Could not instantiate class org.openqa.selenium.firefox.FirefoxDriver
net.thucydides.core.webdriver.UnsupportedDriverException: Could not instantiate class org.openqa.selenium.firefox.FirefoxDriver
	at net.thucydides.core.webdriver.WebDriverFactory.newWebdriverInstance(WebDriverFactory.java:192)
	at net.thucydides.core.webdriver.WebDriverFacade.newDriverInstance(WebDriverFacade.java:88)
	at net.thucydides.core.webdriver.WebDriverFacade.newProxyDriver(WebDriverFacade.java:82)
	at net.thucydides.core.webdriver.WebDriverFacade.getProxiedDriver(WebDriverFacade.java:54)
	at net.thucydides.core.webdriver.javascript.JavascriptExecutorFacade.getRealDriver(JavascriptExecutorFacade.java:143)
	at net.thucydides.core.webdriver.javascript.JavascriptExecutorFacade.getJavascriptEnabledDriver(JavascriptExecutorFacade.java:150)
	at net.thucydides.core.webdriver.javascript.JavascriptExecutorFacade.executeScript(JavascriptExecutorFacade.java:48)
	at net.thucydides.core.pages.jquery.JQueryEnabledPage.isJQueryEnabled(JQueryEnabledPage.java:41)
	at net.thucydides.core.pages.WebElementFacadeImpl.enableHighlightingIfRequired(WebElementFacadeImpl.java:831)
	at net.thucydides.core.pages.WebElementFacadeImpl.click(WebElementFacadeImpl.java:793)
	at sun.reflect.NativeMethodAccessorImpl.invoke0(Native Method)
	at sun.reflect.NativeMethodAccessorImpl.invoke(NativeMethodAccessorImpl.java:62)
	at sun.reflect.DelegatingMethodAccessorImpl.invoke(DelegatingMethodAccessorImpl.java:43)
	at java.lang.reflect.Method.invoke(Method.java:497)
	at net.thucydides.core.annotations.locators.SmartElementHandler.invoke(SmartElementHandler.java:58)
	at com.sun.proxy.$Proxy20.click(Unknown Source)
	at ux.pages.DictionaryPage.lookup_terms(DictionaryPage.java:33)
	at ux.steps.EndUserSteps.starts_search(EndUserSteps.java:24)
	at ux.steps.EndUserSteps$$EnhancerByCGLIB$$c606754b.CGLIB$starts_search$4(<generated>)
	at ux.steps.EndUserSteps$$EnhancerByCGLIB$$c606754b$$FastClassByCGLIB$$b73888b8.invoke(<generated>)
	at net.sf.cglib.proxy.MethodProxy.invokeSuper(MethodProxy.java:228)
	at net.thucydides.core.steps.StepInterceptor.invokeMethod(StepInterceptor.java:300)
	at net.thucydides.core.steps.StepInterceptor.runIfNestedMethodsShouldBeRun(StepInterceptor.java:150)
	at net.thucydides.core.steps.StepInterceptor.runSkippedMethod(StepInterceptor.java:141)
	at net.thucydides.core.steps.StepInterceptor.skipTestStep(StepInterceptor.java:131)
	at net.thucydides.core.steps.StepInterceptor.testStepResult(StepInterceptor.java:122)
	at net.thucydides.core.steps.StepInterceptor.intercept(StepInterceptor.java:51)
	at ux.steps.EndUserSteps$$EnhancerByCGLIB$$c606754b.starts_search(<generated>)
	at ux.steps.EndUserSteps.looks_for(EndUserSteps.java:40)
	at ux.steps.EndUserSteps$$EnhancerByCGLIB$$c606754b.CGLIB$looks_for$1(<generated>)
	at ux.steps.EndUserSteps$$EnhancerByCGLIB$$c606754b$$FastClassByCGLIB$$b73888b8.invoke(<generated>)
	at net.sf.cglib.proxy.MethodProxy.invokeSuper(MethodProxy.java:228)
	at net.thucydides.core.steps.StepInterceptor.invokeMethod(StepInterceptor.java:300)
	at net.thucydides.core.steps.StepInterceptor.runIfNestedMethodsShouldBeRun(StepInterceptor.java:150)
	at net.thucydides.core.steps.StepInterceptor.runSkippedMethod(StepInterceptor.java:141)
	at net.thucydides.core.steps.StepInterceptor.skipTestStep(StepInterceptor.java:131)
	at net.thucydides.core.steps.StepInterceptor.testStepResult(StepInterceptor.java:122)
	at net.thucydides.core.steps.StepInterceptor.intercept(StepInterceptor.java:51)
	at ux.steps.EndUserSteps$$EnhancerByCGLIB$$c606754b.looks_for(<generated>)
	at ux.SearchByKeywordStoryTest.searching_by_keyword_apple_should_display_the_corresponding_article(SearchByKeywordStoryTest.java:36)
	at sun.reflect.NativeMethodAccessorImpl.invoke0(Native Method)
	at sun.reflect.NativeMethodAccessorImpl.invoke(NativeMethodAccessorImpl.java:62)
	at sun.reflect.DelegatingMethodAccessorImpl.invoke(DelegatingMethodAccessorImpl.java:43)
	at java.lang.reflect.Method.invoke(Method.java:497)
	at org.junit.runners.model.FrameworkMethod$1.runReflectiveCall(FrameworkMethod.java:47)
	at org.junit.internal.runners.model.ReflectiveCallable.run(ReflectiveCallable.java:12)
	at org.junit.runners.model.FrameworkMethod.invokeExplosively(FrameworkMethod.java:44)
	at org.junit.internal.runners.statements.InvokeMethod.evaluate(InvokeMethod.java:17)
	at net.thucydides.junit.runners.ThucydidesStatement.evaluate(ThucydidesStatement.java:24)
	at org.junit.runners.ParentRunner.runLeaf(ParentRunner.java:271)
	at org.junit.runners.BlockJUnit4ClassRunner.runChild(BlockJUnit4ClassRunner.java:70)
	at net.thucydides.junit.runners.ThucydidesRunner.runChild(ThucydidesRunner.java:414)
	at org.junit.runners.BlockJUnit4ClassRunner.runChild(BlockJUnit4ClassRunner.java:50)
	at org.junit.runners.ParentRunner$3.run(ParentRunner.java:238)
	at org.junit.runners.ParentRunner$1.schedule(ParentRunner.java:63)
	at org.junit.runners.ParentRunner.runChildren(ParentRunner.java:236)
	at org.junit.runners.ParentRunner.access$000(ParentRunner.java:53)
	at org.junit.runners.ParentRunner$2.evaluate(ParentRunner.java:229)
	at org.junit.runners.ParentRunner.run(ParentRunner.java:309)
	at net.thucydides.junit.runners.ThucydidesRunner.run(ThucydidesRunner.java:229)
	at org.apache.maven.surefire.junitcore.ClassDemarcatingRunner.run(ClassDemarcatingRunner.java:58)
	at org.junit.runners.Suite.runChild(Suite.java:127)
	at org.junit.runners.Suite.runChild(Suite.java:26)
	at org.junit.runners.ParentRunner$3.run(ParentRunner.java:238)
	at java.util.concurrent.Executors$RunnableAdapter.call(Executors.java:511)
	at java.util.concurrent.FutureTask.run(FutureTask.java:266)
	at java.util.concurrent.ThreadPoolExecutor.runWorker(ThreadPoolExecutor.java:1142)
	at java.util.concurrent.ThreadPoolExecutor$Worker.run(ThreadPoolExecutor.java:617)
	at java.lang.Thread.run(Thread.java:745)
Caused by: org.openqa.selenium.WebDriverException: Failed to connect to binary FirefoxBinary(C:\Program Files (x86)\Mozilla Firefox\firefox.exe) on port 7055; process output follows: 
91	addons.manager	DEBUG	Loaded provider scope for resource://gre/modules/addons/PluginProvider.jsm
1444500752592	addons.manager	DEBUG	Starting provider: XPIProvider
1444500752592	addons.xpi	DEBUG	startup
1444500752593	addons.xpi	INFO	Mapping fxdriver@googlecode.com to C:\Users\2BA0~1\AppData\Local\Temp\anonymous173109902710263016webdriver-profile\extensions\fxdriver@googlecode.com
1444500752593	addons.xpi	DEBUG	Ignoring file entry whose name is not a valid add-on ID: C:\Users\2BA0~1\AppData\Local\Temp\anonymous173109902710263016webdriver-profile\extensions\webdriver-staging
1444500752594	addons.xpi	INFO	Mapping {972ce4c6-7e08-4474-a285-3208198ce6fd} to C:\Program Files (x86)\Mozilla Firefox\browser\extensions\{972ce4c6-7e08-4474-a285-3208198ce6fd}
1444500752594	addons.xpi	DEBUG	Skipping unavailable install location app-system-share
1444500752594	addons.xpi	DEBUG	Skipping unavailable install location app-system-local
1444500752595	addons.xpi	DEBUG	checkForChanges
1444500752595	addons.xpi	DEBUG	Loaded add-on state from prefs: {"app-profile":{"fxdriver@googlecode.com":{"d":"C:\\Users\\2BA0~1\\AppData\\Local\\Temp\\anonymous173109902710263016webdriver-profile\\extensions\\fxdriver@googlecode.com","e":false,"v":"2.42.2","st":1444500748997,"mt":1444500748960}},"app-global":{"{972ce4c6-7e08-4474-a285-3208198ce6fd}":{"d":"C:\\Program Files (x86)\\Mozilla Firefox\\browser\\extensions\\{972ce4c6-7e08-4474-a285-3208198ce6fd}","e":true,"v":"41.0.1","st":1444493672631,"mt":1443569298000}}}
1444500752596	addons.xpi	DEBUG	getModTime: Recursive scan of {972ce4c6-7e08-4474-a285-3208198ce6fd}
1444500752597	addons.xpi	DEBUG	getInstallState changed: false, state: {"app-profile":{"fxdriver@googlecode.com":{"d":"C:\\Users\\2BA0~1\\AppData\\Local\\Temp\\anonymous173109902710263016webdriver-profile\\extensions\\fxdriver@googlecode.com","e":false,"v":"2.42.2","st":1444500748997,"mt":1444500748960}},"app-global":{"{972ce4c6-7e08-4474-a285-3208198ce6fd}":{"d":"C:\\Program Files (x86)\\Mozilla Firefox\\browser\\extensions\\{972ce4c6-7e08-4474-a285-3208198ce6fd}","e":true,"v":"41.0.1","st":1444493672631,"mt":1443569298000}}}
1444500752598	addons.xpi	DEBUG	No changes found
1444500752609	addons.manager	DEBUG	Registering shutdown blocker for XPIProvider
1444500752609	addons.manager	DEBUG	Provider finished startup: XPIProvider
1444500752609	addons.manager	DEBUG	Starting provider: LightweightThemeManager
1444500752609	addons.manager	DEBUG	Registering shutdown blocker for LightweightThemeManager
1444500752610	addons.manager	DEBUG	Provider finished startup: LightweightThemeManager
1444500752610	addons.manager	DEBUG	Starting provider: GMPProvider
1444500752615	addons.manager	DEBUG	Registering shutdown blocker for GMPProvider
1444500752615	addons.manager	DEBUG	Provider finished startup: GMPProvider
1444500752615	addons.manager	DEBUG	Starting provider: PluginProvider
1444500752615	addons.manager	DEBUG	Registering shutdown blocker for PluginProvider
1444500752615	addons.manager	DEBUG	Provider finished startup: PluginProvider
1444500752615	addons.manager	DEBUG	Completed startup sequence
1444500752732	addons.xpi-utils	DEBUG	Starting async load of XPI database C:\Users\2BA0~1\AppData\Local\Temp\anonymous173109902710263016webdriver-profile\extensions.json
*** Blocklist::_loadBlocklistFromFile: blocklist is disabled
1444500752864	addons.manager	DEBUG	Starting provider: <unnamed-provider>
1444500752864	addons.manager	DEBUG	Registering shutdown blocker for <unnamed-provider>
1444500752864	addons.manager	DEBUG	Provider finished startup: <unnamed-provider>
1444500752956	addons.xpi-utils	DEBUG	Async JSON file read took 0 MS
1444500752957	addons.xpi-utils	DEBUG	Finished async read of XPI database, parsing...
1444500752957	addons.xpi-utils	DEBUG	Successfully read XPI database
1444500753014	addons.manager	DEBUG	Starting provider: PreviousExperimentProvider
1444500753014	addons.manager	DEBUG	Registering shutdown blocker for PreviousExperimentProvider
1444500753014	addons.manager	DEBUG	Provider finished startup: PreviousExperimentProvider

Build info: version: '2.42.2', revision: '6a6995d31c7c56c340d6f45a76976d43506cd6cc', time: '2014-06-03 10:52:47'
System info: host: 'max', ip: '192.168.1.62', os.name: 'Windows 10', os.arch: 'amd64', os.version: '10.0', java.version: '1.8.0_60'
Driver info: driver.version: FirefoxDriver
	at org.openqa.selenium.firefox.internal.NewProfileExtensionConnection.start(NewProfileExtensionConnection.java:130)
	at org.openqa.selenium.firefox.FirefoxDriver.startClient(FirefoxDriver.java:246)
	at org.openqa.selenium.remote.RemoteWebDriver.<init>(RemoteWebDriver.java:114)
	at org.openqa.selenium.firefox.FirefoxDriver.<init>(FirefoxDriver.java:191)
	at org.openqa.selenium.firefox.FirefoxDriver.<init>(FirefoxDriver.java:186)
	at org.openqa.selenium.firefox.FirefoxDriver.<init>(FirefoxDriver.java:103)
	at net.thucydides.core.webdriver.WebdriverInstanceFactory.newFirefoxDriver(WebdriverInstanceFactory.java:32)
	at net.thucydides.core.webdriver.WebDriverFactory.firefoxDriver(WebDriverFactory.java:535)
	at net.thucydides.core.webdriver.WebDriverFactory.newWebdriverInstance(WebDriverFactory.java:169)
	... 68 more
Caused by: org.openqa.selenium.firefox.NotConnectedException: Unable to connect to host 127.0.0.1 on port 7055 after 45000 ms. Firefox console output:
91	addons.manager	DEBUG	Loaded provider scope for resource://gre/modules/addons/PluginProvider.jsm
1444500752592	addons.manager	DEBUG	Starting provider: XPIProvider
1444500752592	addons.xpi	DEBUG	startup
1444500752593	addons.xpi	INFO	Mapping fxdriver@googlecode.com to C:\Users\2BA0~1\AppData\Local\Temp\anonymous173109902710263016webdriver-profile\extensions\fxdriver@googlecode.com
1444500752593	addons.xpi	DEBUG	Ignoring file entry whose name is not a valid add-on ID: C:\Users\2BA0~1\AppData\Local\Temp\anonymous173109902710263016webdriver-profile\extensions\webdriver-staging
1444500752594	addons.xpi	INFO	Mapping {972ce4c6-7e08-4474-a285-3208198ce6fd} to C:\Program Files (x86)\Mozilla Firefox\browser\extensions\{972ce4c6-7e08-4474-a285-3208198ce6fd}
1444500752594	addons.xpi	DEBUG	Skipping unavailable install location app-system-share
1444500752594	addons.xpi	DEBUG	Skipping unavailable install location app-system-local
1444500752595	addons.xpi	DEBUG	checkForChanges
1444500752595	addons.xpi	DEBUG	Loaded add-on state from prefs: {"app-profile":{"fxdriver@googlecode.com":{"d":"C:\\Users\\2BA0~1\\AppData\\Local\\Temp\\anonymous173109902710263016webdriver-profile\\extensions\\fxdriver@googlecode.com","e":false,"v":"2.42.2","st":1444500748997,"mt":1444500748960}},"app-global":{"{972ce4c6-7e08-4474-a285-3208198ce6fd}":{"d":"C:\\Program Files (x86)\\Mozilla Firefox\\browser\\extensions\\{972ce4c6-7e08-4474-a285-3208198ce6fd}","e":true,"v":"41.0.1","st":1444493672631,"mt":1443569298000}}}
1444500752596	addons.xpi	DEBUG	getModTime: Recursive scan of {972ce4c6-7e08-4474-a285-3208198ce6fd}
1444500752597	addons.xpi	DEBUG	getInstallState changed: false, state: {"app-profile":{"fxdriver@googlecode.com":{"d":"C:\\Users\\2BA0~1\\AppData\\Local\\Temp\\anonymous173109902710263016webdriver-profile\\extensions\\fxdriver@googlecode.com","e":false,"v":"2.42.2","st":1444500748997,"mt":1444500748960}},"app-global":{"{972ce4c6-7e08-4474-a285-3208198ce6fd}":{"d":"C:\\Program Files (x86)\\Mozilla Firefox\\browser\\extensions\\{972ce4c6-7e08-4474-a285-3208198ce6fd}","e":true,"v":"41.0.1","st":1444493672631,"mt":1443569298000}}}
1444500752598	addons.xpi	DEBUG	No changes found
1444500752609	addons.manager	DEBUG	Registering shutdown blocker for XPIProvider
1444500752609	addons.manager	DEBUG	Provider finished startup: XPIProvider
1444500752609	addons.manager	DEBUG	Starting provider: LightweightThemeManager
1444500752609	addons.manager	DEBUG	Registering shutdown blocker for LightweightThemeManager
1444500752610	addons.manager	DEBUG	Provider finished startup: LightweightThemeManager
1444500752610	addons.manager	DEBUG	Starting provider: GMPProvider
1444500752615	addons.manager	DEBUG	Registering shutdown blocker for GMPProvider
1444500752615	addons.manager	DEBUG	Provider finished startup: GMPProvider
1444500752615	addons.manager	DEBUG	Starting provider: PluginProvider
1444500752615	addons.manager	DEBUG	Registering shutdown blocker for PluginProvider
1444500752615	addons.manager	DEBUG	Provider finished startup: PluginProvider
1444500752615	addons.manager	DEBUG	Completed startup sequence
1444500752732	addons.xpi-utils	DEBUG	Starting async load of XPI database C:\Users\2BA0~1\AppData\Local\Temp\anonymous173109902710263016webdriver-profile\extensions.json
*** Blocklist::_loadBlocklistFromFile: blocklist is disabled
1444500752864	addons.manager	DEBUG	Starting provider: <unnamed-provider>
1444500752864	addons.manager	DEBUG	Registering shutdown blocker for <unnamed-provider>
1444500752864	addons.manager	DEBUG	Provider finished startup: <unnamed-provider>
1444500752956	addons.xpi-utils	DEBUG	Async JSON file read took 0 MS
1444500752957	addons.xpi-utils	DEBUG	Finished async read of XPI database, parsing...
1444500752957	addons.xpi-utils	DEBUG	Successfully read XPI database
1444500753014	addons.manager	DEBUG	Starting provider: PreviousExperimentProvider
1444500753014	addons.manager	DEBUG	Registering shutdown blocker for PreviousExperimentProvider
1444500753014	addons.manager	DEBUG	Provider finished startup: PreviousExperimentProvider

	at org.openqa.selenium.firefox.internal.NewProfileExtensionConnection.start(NewProfileExtensionConnection.java:118)
	... 76 more
297222 [pool-1-thread-1] INFO net.thucydides.core.steps.StepInterceptor - SKIPPED STEP: starts_search
297222 [pool-1-thread-1] INFO net.thucydides.core.steps.StepInterceptor - SKIPPED STEP: looks_for
297224 [pool-1-thread-1] INFO net.thucydides.core.steps.StepInterceptor - SKIPPED STEP: should_see_definition
net.thucydides.core.webdriver.UnsupportedDriverException: Could not instantiate class org.openqa.selenium.firefox.FirefoxDriver
297229 [pool-1-thread-1] INFO net.thucydides.core.reports.ReportService - Reporting formats: [JSON, XML, HTML]
297233 [pool-1-thread-1] INFO net.thucydides.core.reports.ReportService - Found reporter: net.thucydides.core.reports.xml.XMLTestOutcomeReporter@199f07b6(format = Optional.of(XML))
297233 [pool-1-thread-1] INFO net.thucydides.core.reports.ReportService - Registering reporter: net.thucydides.core.reports.xml.XMLTestOutcomeReporter@199f07b6
log4j:WARN No appenders could be found for logger (org.jboss.logging).
log4j:WARN Please initialize the log4j system properly.
297584 [pool-1-thread-1] INFO net.thucydides.core.reports.ReportService - Found reporter: net.thucydides.core.reports.json.JSONTestOutcomeReporter@6dc941c7(format = Optional.of(JSON))
297584 [pool-1-thread-1] INFO net.thucydides.core.reports.ReportService - Registering reporter: net.thucydides.core.reports.json.JSONTestOutcomeReporter@6dc941c7
297648 [pool-1-thread-1] INFO net.thucydides.core.reports.ReportService - Found reporter: net.thucydides.core.reports.html.HtmlAcceptanceTestReporter@27864bae(format = Optional.of(HTML))
297648 [pool-1-thread-1] INFO net.thucydides.core.reports.ReportService - Registering reporter: net.thucydides.core.reports.html.HtmlAcceptanceTestReporter@27864bae
297650 [pool-1-thread-1] INFO net.thucydides.core.reports.ReportService - Generating reports using: net.thucydides.core.reports.xml.XMLTestOutcomeReporter@199f07b6
297655 [pool-1-thread-1] INFO net.thucydides.core.reports.ReportService - Processing test outcome Search by keyword:searching_by_keyword_banana_should_display_the_corresponding_article
297655 [pool-1-thread-1] INFO net.thucydides.core.reports.ReportService - net.thucydides.core.reports.xml.XMLTestOutcomeReporter@199f07b6: Generating report for test outcome: Search by keyword:searching_by_keyword_banana_should_display_the_corresponding_article
297775 [pool-1-thread-1] INFO net.thucydides.core.reports.xml.XMLTestOutcomeReporter - Generating XML report for Searching by keyword banana should display the corresponding article to file C:\Users\Максим\workspace\msux\target\site\thucydides\ced16a1cbe7b14933a8043c87a0090b0d18e0e9c7f25788cda11b0dcb41fe1ce.xml
297837 [pool-1-thread-1] INFO net.thucydides.core.reports.xml.XMLTestOutcomeReporter - XML report generated (C:\Users\Максим\workspace\msux\target\site\thucydides\ced16a1cbe7b14933a8043c87a0090b0d18e0e9c7f25788cda11b0dcb41fe1ce.xml bytes) 1945
297853 [pool-1-thread-1] INFO net.thucydides.core.reports.ReportService - Report generated for Search by keyword:searching_by_keyword_banana_should_display_the_corresponding_article
297865 [pool-2-thread-2] INFO net.thucydides.core.reports.ReportService - Processing test outcome Search by keyword:searching_by_ambiguious_keyword_should_display_the_disambiguation_page
297865 [pool-2-thread-2] INFO net.thucydides.core.reports.ReportService - net.thucydides.core.reports.xml.XMLTestOutcomeReporter@199f07b6: Generating report for test outcome: Search by keyword:searching_by_ambiguious_keyword_should_display_the_disambiguation_page
297870 [pool-2-thread-3] INFO net.thucydides.core.reports.ReportService - Processing test outcome Search by keyword:searching_by_keyword_apple_should_display_the_corresponding_article
297870 [pool-2-thread-3] INFO net.thucydides.core.reports.ReportService - net.thucydides.core.reports.xml.XMLTestOutcomeReporter@199f07b6: Generating report for test outcome: Search by keyword:searching_by_keyword_apple_should_display_the_corresponding_article
297884 [pool-2-thread-2] INFO net.thucydides.core.reports.xml.XMLTestOutcomeReporter - Generating XML report for Searching by ambiguious keyword should display the disambiguation page to file C:\Users\Максим\workspace\msux\target\site\thucydides\f0d9d6c938a3f215ed0eb035374d1e283065636bb1154a9ab23538059af68cf1.xml
297884 [pool-2-thread-3] INFO net.thucydides.core.reports.xml.XMLTestOutcomeReporter - Generating XML report for Searching by keyword apple should display the corresponding article to file C:\Users\Максим\workspace\msux\target\site\thucydides\14a171ad4f9b21902e81150a9e5c8af4095e8987796c2640d7f6aee21cd913ca.xml
297891 [pool-2-thread-2] INFO net.thucydides.core.reports.xml.XMLTestOutcomeReporter - XML report generated (C:\Users\Максим\workspace\msux\target\site\thucydides\f0d9d6c938a3f215ed0eb035374d1e283065636bb1154a9ab23538059af68cf1.xml bytes) 705
297893 [pool-2-thread-3] INFO net.thucydides.core.reports.xml.XMLTestOutcomeReporter - XML report generated (C:\Users\Максим\workspace\msux\target\site\thucydides\14a171ad4f9b21902e81150a9e5c8af4095e8987796c2640d7f6aee21cd913ca.xml bytes) 1993
297893 [pool-2-thread-2] INFO net.thucydides.core.reports.ReportService - Report generated for Search by keyword:searching_by_ambiguious_keyword_should_display_the_disambiguation_page
297894 [pool-2-thread-3] INFO net.thucydides.core.reports.ReportService - Report generated for Search by keyword:searching_by_keyword_apple_should_display_the_corresponding_article
297904 [pool-1-thread-1] INFO net.thucydides.core.reports.ReportService - Reports generated in: 254
297904 [pool-1-thread-1] INFO net.thucydides.core.reports.ReportService - Generating reports using: net.thucydides.core.reports.json.JSONTestOutcomeReporter@6dc941c7
297904 [pool-3-thread-1] INFO net.thucydides.core.reports.ReportService - Processing test outcome Search by keyword:searching_by_keyword_banana_should_display_the_corresponding_article
297904 [pool-3-thread-3] INFO net.thucydides.core.reports.ReportService - Processing test outcome Search by keyword:searching_by_keyword_apple_should_display_the_corresponding_article
297904 [pool-3-thread-1] INFO net.thucydides.core.reports.ReportService - net.thucydides.core.reports.json.JSONTestOutcomeReporter@6dc941c7: Generating report for test outcome: Search by keyword:searching_by_keyword_banana_should_display_the_corresponding_article
297904 [pool-3-thread-3] INFO net.thucydides.core.reports.ReportService - net.thucydides.core.reports.json.JSONTestOutcomeReporter@6dc941c7: Generating report for test outcome: Search by keyword:searching_by_keyword_apple_should_display_the_corresponding_article
297905 [pool-3-thread-2] INFO net.thucydides.core.reports.ReportService - Processing test outcome Search by keyword:searching_by_ambiguious_keyword_should_display_the_disambiguation_page
297905 [pool-3-thread-2] INFO net.thucydides.core.reports.ReportService - net.thucydides.core.reports.json.JSONTestOutcomeReporter@6dc941c7: Generating report for test outcome: Search by keyword:searching_by_ambiguious_keyword_should_display_the_disambiguation_page
297988 [pool-3-thread-2] INFO net.thucydides.core.reports.ReportService - Report generated for Search by keyword:searching_by_ambiguious_keyword_should_display_the_disambiguation_page
297989 [pool-3-thread-3] INFO net.thucydides.core.reports.ReportService - Report generated for Search by keyword:searching_by_keyword_apple_should_display_the_corresponding_article
297990 [pool-3-thread-1] INFO net.thucydides.core.reports.ReportService - Report generated for Search by keyword:searching_by_keyword_banana_should_display_the_corresponding_article
298001 [pool-1-thread-1] INFO net.thucydides.core.reports.ReportService - Reports generated in: 97
298001 [pool-1-thread-1] INFO net.thucydides.core.reports.ReportService - Generating reports using: net.thucydides.core.reports.html.HtmlAcceptanceTestReporter@27864bae
298002 [pool-4-thread-2] INFO net.thucydides.core.reports.ReportService - Processing test outcome Search by keyword:searching_by_ambiguious_keyword_should_display_the_disambiguation_page
298002 [pool-4-thread-2] INFO net.thucydides.core.reports.ReportService - net.thucydides.core.reports.html.HtmlAcceptanceTestReporter@27864bae: Generating report for test outcome: Search by keyword:searching_by_ambiguious_keyword_should_display_the_disambiguation_page
298002 [pool-4-thread-1] INFO net.thucydides.core.reports.ReportService - Processing test outcome Search by keyword:searching_by_keyword_banana_should_display_the_corresponding_article
298003 [pool-4-thread-1] INFO net.thucydides.core.reports.ReportService - net.thucydides.core.reports.html.HtmlAcceptanceTestReporter@27864bae: Generating report for test outcome: Search by keyword:searching_by_keyword_banana_should_display_the_corresponding_article
298003 [pool-4-thread-3] INFO net.thucydides.core.reports.ReportService - Processing test outcome Search by keyword:searching_by_keyword_apple_should_display_the_corresponding_article
298003 [pool-4-thread-3] INFO net.thucydides.core.reports.ReportService - net.thucydides.core.reports.html.HtmlAcceptanceTestReporter@27864bae: Generating report for test outcome: Search by keyword:searching_by_keyword_apple_should_display_the_corresponding_article
298007 [pool-4-thread-2] INFO net.thucydides.core.requirements.RequirementsTagProvider - Reading requirements from net.thucydides.core.requirements.FileSystemRequirementsTagProvider@3e059df9
298007 [pool-4-thread-2] INFO net.thucydides.core.requirements.RequirementsTagProvider - Reading requirements from net.thucydides.core.requirements.PackageAnnotationBasedTagProvider@3cd63852
298008 [pool-4-thread-2] INFO net.thucydides.core.requirements.RequirementsTagProvider - Requirements found:[]
298553 [pool-4-thread-3] INFO net.thucydides.core.reports.html.HtmlAcceptanceTestReporter - GENERATING HTML REPORT FOR Search by keyword:searching_by_keyword_apple_should_display_the_corresponding_article => 14a171ad4f9b21902e81150a9e5c8af4095e8987796c2640d7f6aee21cd913ca.html
298561 [pool-4-thread-1] INFO net.thucydides.core.reports.html.HtmlAcceptanceTestReporter - GENERATING HTML REPORT FOR Search by keyword:searching_by_keyword_banana_should_display_the_corresponding_article => ced16a1cbe7b14933a8043c87a0090b0d18e0e9c7f25788cda11b0dcb41fe1ce.html
298581 [pool-4-thread-1] INFO net.thucydides.core.reports.ReportService - Report generated for Search by keyword:searching_by_keyword_banana_should_display_the_corresponding_article
298582 [pool-4-thread-3] INFO net.thucydides.core.reports.ReportService - Report generated for Search by keyword:searching_by_keyword_apple_should_display_the_corresponding_article
299558 [pool-4-thread-2] INFO net.thucydides.core.reports.html.HtmlAcceptanceTestReporter - GENERATING HTML REPORT FOR Search by keyword:searching_by_ambiguious_keyword_should_display_the_disambiguation_page => f0d9d6c938a3f215ed0eb035374d1e283065636bb1154a9ab23538059af68cf1.html
299560 [pool-4-thread-2] INFO net.thucydides.core.reports.ReportService - Report generated for Search by keyword:searching_by_ambiguious_keyword_should_display_the_disambiguation_page
299584 [pool-1-thread-1] INFO net.thucydides.core.reports.ReportService - Reports generated in: 1583
Tests run: 3, Failures: 0, Errors: 2, Skipped: 0, Time elapsed: -1,391,341.835 sec <<< FAILURE!

Results :

Tests in error: 
  searching_by_keyword_banana_should_display_the_corresponding_article(ux.SearchByKeywordStoryTest): Could not instantiate class org.openqa.selenium.firefox.FirefoxDriver
  searching_by_keyword_apple_should_display_the_corresponding_article(ux.SearchByKeywordStoryTest): Could not instantiate class org.openqa.selenium.firefox.FirefoxDriver

Tests run: 3, Failures: 0, Errors: 2, Skipped: 0

[WARNING] File encoding has not been set, using platform encoding Cp1251, i.e. build is platform dependent!
[INFO] 
[INFO] --- maven-thucydides-plugin:0.9.268:aggregate (thucydides-reports) @ msux ---
log4j:WARN No appenders could be found for logger (org.jboss.logging).
log4j:WARN Please initialize the log4j system properly.
[INFO] Reading requirements from net.thucydides.core.requirements.FileSystemRequirementsTagProvider@79ad1774
[INFO] Reading requirements from net.thucydides.core.requirements.PackageAnnotationBasedTagProvider@64f3ca6
[INFO] Requirements found:[]
[INFO] Generating release reports for: []
[INFO] 
[INFO] --- maven-failsafe-plugin:2.12:verify (default) @ msux ---
[INFO] Failsafe report directory: C:\Users\Максим\workspace\msux\target\failsafe-reports
[WARNING] File encoding has not been set, using platform encoding Cp1251, i.e. build is platform dependent!
[INFO] ------------------------------------------------------------------------
[INFO] BUILD FAILURE
[INFO] ------------------------------------------------------------------------
[INFO] Total time: 05:11 min
[INFO] Finished at: 2015-10-10T21:13:26+03:00
[INFO] Final Memory: 40M/251M
[INFO] ------------------------------------------------------------------------
[ERROR] Failed to execute goal org.apache.maven.plugins:maven-failsafe-plugin:2.12:verify (default) on project msux: There are test failures.
[ERROR] 
[ERROR] Please refer to C:\Users\Максим\workspace\msux\target\failsafe-reports for the individual test results.
[ERROR] -> [Help 1]
[ERROR] 
[ERROR] To see the full stack trace of the errors, re-run Maven with the -e switch.
[ERROR] Re-run Maven using the -X switch to enable full debug logging.
[ERROR] 
[ERROR] For more information about the errors and possible solutions, please read the following articles:
[ERROR] [Help 1] http://cwiki.apache.org/confluence/display/MAVEN/MojoFailureException

(Руслан) #3

можно .pom и версию мозиллы?


(Руслан) #4

попробуйте

   <properties>
        <project.build.sourceEncoding>UTF-8</project.build.sourceEncoding>
        <thucydides.version>0.9.275</thucydides.version>
        <webdriver.driver>firefox</webdriver.driver>
    </properties>


 <dependency>
            <groupId>org.seleniumhq.selenium</groupId>
            <artifactId>selenium-java</artifactId>
            <version>2.48.0</version>
        </dependency>
        <dependency>
            <groupId>net.thucydides</groupId>
            <artifactId>thucydides-core</artifactId>
            <version>${thucydides.version}</version>
        </dependency>
        <dependency>
            <groupId>net.thucydides</groupId>
            <artifactId>thucydides-junit</artifactId>
            <version>${thucydides.version}</version>
            <scope>test</scope>
        </dependency>

(Maxim Fokin) #5

Mozilla 41.0.1

<?xml version="1.0" encoding="UTF-8"?>
<project xmlns="http://maven.apache.org/POM/4.0.0" xmlns:xsi="http://www.w3.org/2001/XMLSchema-instance"
         xsi:schemaLocation="http://maven.apache.org/POM/4.0.0 http://maven.apache.org/xsd/maven-4.0.0.xsd">
    <modelVersion>4.0.0</modelVersion>

    <groupId>ms</groupId>
    <artifactId>msux</artifactId>
    <version>0.0.1-SNAPSHOT</version>
    <packaging>jar</packaging>

    <name>Sample Thucydides project</name>

    <properties>
        <project.build.sourceEncoding>UTF-8</project.build.sourceEncoding>
        <thucydides.version>0.9.268</thucydides.version>
        <webdriver.driver>firefox</webdriver.driver>
    </properties>

    <dependencies>
        <dependency>
            <groupId>net.thucydides</groupId>
            <artifactId>thucydides-core</artifactId>
            <version>${thucydides.version}</version>
        </dependency>
        <dependency>
            <groupId>org.slf4j</groupId>
            <artifactId>slf4j-simple</artifactId>
            <version>1.6.1</version>
        </dependency>
        <dependency>
            <groupId>net.thucydides</groupId>
            <artifactId>thucydides-junit</artifactId>
            <version>${thucydides.version}</version>
            <scope>test</scope>
        </dependency>
        <dependency>
            <groupId>junit</groupId>
            <artifactId>junit</artifactId>
            <version>4.11</version>
            <scope>test</scope>
        </dependency>
        <dependency>
            <groupId>org.easytesting</groupId>
            <artifactId>fest-assert</artifactId>
            <version>1.4</version>
        </dependency>
    </dependencies>
    <build>
        <plugins>
            <plugin>
                <groupId>org.apache.maven.plugins</groupId>
                <artifactId>maven-surefire-plugin</artifactId>
                <version>2.12</version>
                <configuration>
                    <skip>true</skip>
                </configuration>
            </plugin>
            <plugin>
                <artifactId>maven-failsafe-plugin</artifactId>
                <version>2.12</version>
                <configuration>
                    <includes>
                        <include>**/*Test.java</include>
                        <include>**/Test*.java</include>
                        <include>**/When*.java</include>
                    </includes>
                    <argLine>-Xmx512m</argLine>
                    <parallel>classes</parallel>
                    <systemPropertyVariables>
                        <webdriver.driver>${webdriver.driver}</webdriver.driver>
                    </systemPropertyVariables>
                </configuration>
                <executions>
                    <execution>
                        <goals>
                            <goal>integration-test</goal>
                            <goal>verify</goal>
                        </goals>
                    </execution>
                </executions>
            </plugin>
            <plugin>
                <groupId>org.apache.maven.plugins</groupId>
                <artifactId>maven-compiler-plugin</artifactId>
                <version>2.3.2</version>
                <configuration>
                    <source>1.5</source>
                    <target>1.5</target>
                </configuration>
            </plugin>
            <plugin>
                <groupId>net.thucydides.maven.plugins</groupId>
                <artifactId>maven-thucydides-plugin</artifactId>
                <version>${thucydides.version}</version>
                <executions>
                    <execution>
                        <id>thucydides-reports</id>
                        <phase>post-integration-test</phase>
                        <goals>
                            <goal>aggregate</goal>
                        </goals>
                    </execution>
                </executions>
            </plugin>
        </plugins>
    </build>

    <profiles>
        <profile>
            <id>maven2</id>
            <activation>
                <file>
                    <missing>${basedir}</missing>
                </file>
            </activation>
            <reporting>
                <plugins>
                    <plugin>
                        <groupId>net.thucydides.maven.plugins</groupId>
                        <artifactId>maven-thucydides-plugin</artifactId>
                        <version>${thucydides.version}</version>
                    </plugin>
                </plugins>
            </reporting>
        </profile>
        <profile>
            <id>maven3</id>
            <activation>
                <file>
                    <exists>${basedir}</exists>
                </file>
            </activation>
            <build>
                <plugins>
                    <plugin>
                        <groupId>org.apache.maven.plugins</groupId>
                        <artifactId>maven-site-plugin</artifactId>
                        <version>3.0-beta-3</version>
                        <configuration>
                            <reportPlugins>
                                <plugin>
                                    <groupId>net.thucydides.maven.plugins</groupId>
                                    <artifactId>maven-thucydides-plugin</artifactId>
                                    <version>${thucydides.version}</version>
                                </plugin>
                            </reportPlugins>
                        </configuration>
                    </plugin>
                </plugins>
            </build>
        </profile>
    </profiles>
</project>

(Руслан) #6

измените свои параметры в .pom на те, что я дал

и

      <dependency>
        <groupId>org.seleniumhq.selenium</groupId>
        <artifactId>selenium-java</artifactId>
        <version>2.48.0</version>
    </dependency>

у вас не вижу


(Maxim Fokin) #7

Добавил, не помогло

<?xml version="1.0" encoding="UTF-8"?>
<project xmlns="http://maven.apache.org/POM/4.0.0" xmlns:xsi="http://www.w3.org/2001/XMLSchema-instance"
         xsi:schemaLocation="http://maven.apache.org/POM/4.0.0 http://maven.apache.org/xsd/maven-4.0.0.xsd">
    <modelVersion>4.0.0</modelVersion>

    <groupId>ms</groupId>
    <artifactId>msux</artifactId>
    <version>0.0.1-SNAPSHOT</version>
    <packaging>jar</packaging>

    <name>Sample Thucydides project</name>

    <properties>
        <project.build.sourceEncoding>UTF-8</project.build.sourceEncoding>
        <thucydides.version>0.9.275</thucydides.version>
        <webdriver.driver>firefox</webdriver.driver>
    </properties>

    <dependencies>
	    <dependency>
	        <groupId>org.seleniumhq.selenium</groupId>
            <artifactId>selenium-java</artifactId>
            <version>2.48.0</version>
        </dependency>
        <dependency>
            <groupId>net.thucydides</groupId>
            <artifactId>thucydides-core</artifactId>
            <version>${thucydides.version}</version>
        </dependency>
        <dependency>
            <groupId>org.slf4j</groupId>
            <artifactId>slf4j-simple</artifactId>
            <version>1.6.1</version>
        </dependency>
        <dependency>
            <groupId>net.thucydides</groupId>
            <artifactId>thucydides-junit</artifactId>
            <version>${thucydides.version}</version>
            <scope>test</scope>
        </dependency>
        <dependency>
            <groupId>junit</groupId>
            <artifactId>junit</artifactId>
            <version>4.11</version>
            <scope>test</scope>
        </dependency>
        <dependency>
            <groupId>org.easytesting</groupId>
            <artifactId>fest-assert</artifactId>
            <version>1.4</version>
        </dependency>
    </dependencies>
    <build>
        <plugins>
            <plugin>
                <groupId>org.apache.maven.plugins</groupId>
                <artifactId>maven-surefire-plugin</artifactId>
                <version>2.12</version>
                <configuration>
                    <skip>true</skip>
                </configuration>
            </plugin>
            <plugin>
                <artifactId>maven-failsafe-plugin</artifactId>
                <version>2.12</version>
                <configuration>
                    <includes>
                        <include>**/*Test.java</include>
                        <include>**/Test*.java</include>
                        <include>**/When*.java</include>
                    </includes>
                    <argLine>-Xmx512m</argLine>
                    <parallel>classes</parallel>
                    <systemPropertyVariables>
                        <webdriver.driver>${webdriver.driver}</webdriver.driver>
                    </systemPropertyVariables>
                </configuration>
                <executions>
                    <execution>
                        <goals>
                            <goal>integration-test</goal>
                            <goal>verify</goal>
                        </goals>
                    </execution>
                </executions>
            </plugin>
            <plugin>
                <groupId>org.apache.maven.plugins</groupId>
                <artifactId>maven-compiler-plugin</artifactId>
                <version>2.3.2</version>
                <configuration>
                    <source>1.5</source>
                    <target>1.5</target>
                </configuration>
            </plugin>
            <plugin>
                <groupId>net.thucydides.maven.plugins</groupId>
                <artifactId>maven-thucydides-plugin</artifactId>
                <version>${thucydides.version}</version>
                <executions>
                    <execution>
                        <id>thucydides-reports</id>
                        <phase>post-integration-test</phase>
                        <goals>
                            <goal>aggregate</goal>
                        </goals>
                    </execution>
                </executions>
            </plugin>
        </plugins>
    </build>

    <profiles>
        <profile>
            <id>maven2</id>
            <activation>
                <file>
                    <missing>${basedir}</missing>
                </file>
            </activation>
            <reporting>
                <plugins>
                    <plugin>
                        <groupId>net.thucydides.maven.plugins</groupId>
                        <artifactId>maven-thucydides-plugin</artifactId>
                        <version>${thucydides.version}</version>
                    </plugin>
                </plugins>
            </reporting>
        </profile>
        <profile>
            <id>maven3</id>
            <activation>
                <file>
                    <exists>${basedir}</exists>
                </file>
            </activation>
            <build>
                <plugins>
                    <plugin>
                        <groupId>org.apache.maven.plugins</groupId>
                        <artifactId>maven-site-plugin</artifactId>
                        <version>3.0-beta-3</version>
                        <configuration>
                            <reportPlugins>
                                <plugin>
                                    <groupId>net.thucydides.maven.plugins</groupId>
                                    <artifactId>maven-thucydides-plugin</artifactId>
                                    <version>${thucydides.version}</version>
                                </plugin>
                            </reportPlugins>
                        </configuration>
                    </plugin>
                </plugins>
            </build>
        </profile>
    </profiles>
</project>

(Руслан) #8

ошибка та же? или изменилась?


(Maxim Fokin) #9

Ошибка та же

Results :

Tests in error: 
  searching_by_keyword_banana_should_display_the_corresponding_article(ux.SearchByKeywordStoryTest): Could not instantiate class org.openqa.selenium.firefox.FirefoxDriver
  searching_by_keyword_apple_should_display_the_corresponding_article(ux.SearchByKeywordStoryTest): Could not instantiate class org.openqa.selenium.firefox.FirefoxDriver

Tests run: 3, Failures: 0, Errors: 2, Skipped: 0

(Руслан) #10

или

<configuration>
  <systemPropertyVariables>
    <webdriver.firefox.bin>C:\Program Files (x86)\Mozilla Firefox\firefox.exe</webdriver.firefox.bin>
  </systemPropertyVariables>
</configuration>

(Maxim Fokin) #11

Это для какого плагина добавить конфигурацию?


(Maxim Fokin) #12

Заработал, спасибо! Полный путь к екзешнику не обязательно было указывать.


(Руслан) #13

ну я шаблон отправил))